{"text_format":"1","workbook":"xlsx","n_sheets":34,"sheets":["START","Instructions","Template names","Lookup and lists","Org structure","Contacts","C1-Sum","C2-FinPerf SC","C2C","C3-FinPerf V","C3C","C4-FinPerf RE","C5-Capex","C5C","C6-FinPos","C7-CFlow","SC1","SC2","SC3","SC4","SC5","SC6","SC7(1)","SC7(2)","SC8","SC9","SC10","SC11","SC12","SC13a","SC13b","SC13c","SC13d","SC71charts"],"not_rendered":{"charts":5,"images":17,"macros":1,"external_links":9,"defined_names":1514,"comments":0,"pivot_tables":0},"unopened":[],"bounds":{"document_bytes":16777216,"sheet_cells":100000,"rows_first":2000,"rows_last":500,"rows_between":2000,"halvings":0,"cell_chars":16384,"cell_head_chars":4096},"cells_cut":0,"cells_raw":0,"read":"whole","date_system":"1900"}

{"sheet":"START","index":0,"n_rows":1,"n_cols":1,"rows_kept":1,"cut":false,"hidden":false,"merged":[]}
[{"$f":"muni","v":"FS184 Matjhabeng"}]

{"sheet":"Instructions","index":1,"n_rows":55,"n_cols":25,"rows_kept":55,"cut":false,"hidden":false,"merged":[]}
[]
[null,null,null,2020]
[]
[null,null,null,null,null,null,null,null,null,null,null,null,null,null,null,null,null,null,null,null,null,null,null,"Yes"]
[null,null,null,null,null,null,null,null,null,null,null,null,null,null,null,null,null,null,null,null,null,null,null,"No"]
[]
[null,null,null,null,null,null,null,null,null,null,null,null,null,null,null,null,null,null,null,null,null,null,"Type of Entities Range:","Parent Municipality"]
[null,null,null,null,null,null,null,null,null,null,null,null,null,null,null,null,null,null,null,null,null,null,null,"Consolidated Information"]
[]
[null,null,null,null,null,null,null,null,null,null,null,null,null,null,null,null,null,null,null,null,null,null,"Date linked",8]
[null,null,null,null,null,null,null,null,null,null,null,null,null,null,null,null,null,null,null,null,null,null,"Date",{"$f":"VLOOKUP(X10,W39:X55,2)","v":"M08 February"},"2013-08-01"]
[]
[]
[]
[]
[]
[]
[]
[null,null,null,null,null,null,null,null,null,null,null,null,null,null,null,null,null,null,null,null,null,null,"MTREF Range:",2008]
[null,null,null,null,null,null,null,null,null,null,null,null,null,null,null,null,null,null,null,null,null,null,null,2009]
[null,null,null,null,null,null,null,null,null,null,null,null,null,null,null,null,null,null,null,null,null,null,null,2010]
[null,null,null,null,null,null,null,null,null,null,null,null,null,null,null,null,null,null,null,null,null,null,null,2011]
[null,null,null,null,null,null,null,null,null,null,null,null,null,null,null,null,null,null,null,null,null,null,null,2012]
[null,null,null,null,null,null,null,null,null,null,null,null,null,null,null,null,null,null,null,null,null,null,null,2013]
[null,null,null,null,null,null,null,null,null,null,null,null,null,null,null,null,null,null,null,null,null,null,null,2014]
[null,null,null,null,null,null,null,null,null,null,null,null,null,null,null,null,null,null,null,null,null,null,null,2015]
[null,null,null,null,null,null,null,null,null,null,null,null,null,null,null,null,null,null,null,null,null,null,null,2016]
[null,null,null,null,null,null,null,null,null,null,null,null,null,null,null,null,null,null,null,null,null,null,null,2017]
[null,null,null,null,null,null,null,null,null,null,null,null,null,null,null,null,null,null,null,null,null,null,null,2018]
[null,null,null,null,null,null,null,null,null,null,null,null,null,null,null,null,null,null,null,null,null,null,null,2019]
[null,null,null,null,null,null,null,null,null,null,null,null,null,null,null,null,null,null,null,null,null,null,null,2020]
[null,null,null,null,null,null,null,null,null,null,null,null,null,null,null,null,null,null,null,null,null,null,null,2021]
[null,null,null,null,null,null,null,null,null,null,null,null,null,null,null,null,null,null,null,null,null,null,null,2022]
[null,null,null,null,null,null,null,null,null,null,null,null,null,null,null,null,null,null,null,null,null,null,"MTREF Linked:"]
[null,null,null,null,null,null,null,null,null,null,null,null,null,null,null,null,null,null,null,null,null,null,"MTREF:",8]
[null,null,null,null,null,null,null,null,null,null,null,null,null,null,null,null,null,null,null,null,null,null,null,{"$f":"INDEX(X19:X33,X35,1)","v":2015}]
[null,null,null,null,null,null,null,null,null,null,null,null,null,null,null,null,null,null,null,null,null,null,"Fin Year:"]
[null,null,null,null,null,null,null,null,null,null,null,null,null,null,null,null,null,null,null,null,null,null,null,{"$f":"MTREF&\"/\"&RIGHT(MTREF,2)+1","v":"2015/16"}]
[null,null,null,null,null,null,null,null,null,null,null,null,null,null,null,null,null,null,null,null,null,"Date/type of report",1,"M01 July"]
[null,null,null,null,null,null,null,null,null,null,null,null,null,null,null,null,null,null,null,null,null,null,2,"M02 August"]
[null,null,null,null,null,null,null,null,null,null,null,null,null,null,null,null,null,null,null,null,null,null,3,"M03 September"]
[null,null,null,null,null,null,null,null,null,null,null,null,null,null,null,null,null,null,null,null,null,null,4,"M04 October"]
[null,null,null,null,null,null,null,null,null,null,null,null,null,null,null,null,null,null,null,null,null,null,5,"M05 November"]
[null,null,null,null,null,null,null,null,null,null,null,null,null,null,null,null,null,null,null,null,null,null,6,"M06 December"]
[null,null,null,null,null,null,null,null,null,null,null,null,null,null,null,null,null,null,null,null,null,null,7,"M07 January"]
[null,null,null,null,null,null,null,null,null,null,null,null,null,null,null,null,null,null,null,null,null,null,8,"M08 February"]
[null,null,null,null,null,null,null,null,null,null,null,null,null,null,null,null,null,null,null,null,null,null,9,"M09 March"]
[null,null,null,null,null,null,null,null,null,null,null,null,null,null,null,null,null,null,null,null,null,null,10,"M10 April"]
[null,null,null,null,null,null,null,null,null,null,null,null,null,null,null,null,null,null,null,null,null,null,11,"M11 May"]
[null,null,null,null,null,null,null,null,null,null,null,null,null,null,null,null,null,null,null,null,null,null,12,"M12 June"]
[null,null,null,null,null,null,null,null,null,null,null,null,null,null,null,null,null,null,null,null,null,null,13,"Q1 First Quarter"]
[null,null,null,null,null,null,null,null,null,null,null,null,null,null,null,null,null,null,null,null,null,null,14,"Q2 Second Quarter"]
[null,null,null,null,null,null,null,null,null,null,null,null,null,null,null,null,null,null,null,null,null,null,15,"Q3 Third Quarter"]
[null,null,null,null,null,null,null,null,null,null,null,null,null,null,null,null,null,null,null,null,null,null,16,"Q4 Fourth Quarter"]
[null,null,null,null,null,null,null,null,null,null,null,null,null,null,null,null,null,null,null,null,null,null,17,"Mid-Year Assessment"]

{"sheet":"Template names","index":2,"n_rows":106,"n_cols":6,"rows_kept":106,"cut":false,"hidden":true,"merged":[[0,0,0,3],[75,0,75,1],[71,0,71,3]]}
["Common sheet headings"]
["Head1",{"$f":"HLOOKUP(MTREF,Headings,2)","v":"2014/15"},"Prior year -1"]
["Head2",{"$f":"HLOOKUP(MTREF,Headings,5)","v":"Budget Year 2015/16"},"Year of approved budget"]
["Head2A",{"$f":"HLOOKUP(MTREF,Headings,4)","v":"2015/16"},"Approved budget year"]
["Head3",{"$f":"HLOOKUP(MTREF,Headings,3)","v":"2015/16 Medium Term Revenue & Expenditure Framework"},"MTREF header name"]
["Head5","Audited Outcome"]
["Head5A","Outcome"]
["Head5B","Pre-audit outcome"]
["Head6","Original Budget"]
["Head7","Adjusted Budget"]
["Head8","Full Year Forecast"]
["Head9",{"$f":"HLOOKUP(MTREF,Headings,5)","v":"Budget Year 2015/16"},"1st year of MTREF","Year1"]
["Head10",{"$f":"HLOOKUP(MTREF,Headings,6)","v":"Budget Year +1 2016/17"},"2nd year of MTREF","Year2"]
["Head11",{"$f":"HLOOKUP(MTREF,Headings,7)","v":"Budget Year +2 2017/18"},"3rd year of MTREF","Year3"]
["Head12","Forecast 2010/11",null,"Year4"]
["Head13","Forecast 2011/12",null,"Year5"]
["Head14","Forecast 2012/13",null,"Year6"]
["Head15","Forecast 2013/14",null,"Year7"]
["Head16","Forecast 2014/15",null,"Year8"]
["Head17","Forecast 2015/16",null,"Year9"]
["Head18","Forecast 2016/17",null,"Year10"]
["Head19","Forecast 2017/18",null,"Year11"]
["Head20","Forecast 2018/19",null,"Year12"]
["Head21","Forecast 2019/20",null,"Year13"]
["Head22","Forecast 2020/21",null,"Year14"]
["Head23","Forecast 2021/22",null,"Year15"]
["Head24","Description",null,"Desc"]
["Head25","Schedule of funding diligence",null,"fdil"]
["Head26","Vote Description",null,"VDesc"]
["Head27","Ref"]
["Head27a","References"]
["Head28","Surplus/ (Deficit) for the year",null,"Result"]
["Head29","Annual target 2007/08"]
["Head30","Revised target 2007/08"]
["Head31","Quarter ended 30 September"]
["Head32","Quarter ended 31 December"]
["Head33","Quarter ended 31 March"]
["Head34","Quarter ended 30 June"]
["Head35","Variance explanation"]
["Head36","YTD  Actual 31 Dec"]
["Head37","YTD  Budget 31 Dec"]
["Head38","Monthly actual"]
["Head39","YearTD actual"]
["Head40","YearTD budget"]
["Head41","YTD variance"]
["Head42","Surplus/ (Deficit) for the yr/period"]
["Head43",{"$f":"Head3&\" Summary\"","v":"2015/16 Medium Term Revenue & Expenditure Framework Summary"}]
["Head44","1996 Census"]
["Head45","2001 Census"]
["Head46"," - Adjustments Budget - Month YYYY"]
["Head47","Previous target year to complete"]
["Head48","Present value"]
["Head49","Virement"]
["Head50","Other Adjusts."]
["Head51","Accum. Funds"]
["Head52","Multi-year capital"]
["Head53","Unfore. Unavoid."]
["Head54","Prior Adjusted"]
["Head55","Nat. or Prov. Govt"]
["Head56","Total Adjusts."]
["Head57",{"$f":"date","v":"M08 February"}]
["Head58","Parent muni."]
["Head59","Downward adjusts"]
["Head60","Month","Report header part name",{"$f":"MONTH(date)","v":{"$error":"#VALUE!"}}]
["SFPerf1","Budgeted Financial Performance"]
["SFPerf2","Forecast Financial Performance"]
["SFPos1","Budgeted Financial Position"]
["SFPos2","Forecast Financial Position"]
["Cash1","Budget Cash Flow"]
["Cash2","Forecast Cash Flow"]
["RandM","Expenditure includes repairs & maintenance of R'000"]
["Standard nomenclature"]
["Muni",{"$f":"'Lookup and lists'!B27","v":"FS184 Matjhabeng"}]
["Municipal Entities",2,"Type of report:",3]
[{"$f":"IF((MuniEntities=1)*(MuniType=2),\"YES\",\"NO\")","v":"NO"},"Does this municipality have entities (consolidated budget and entity budgets required)? YES/NO"]
["s71 (Monthly Mayor report) schedules and charts"]
["S71sum",{"$f":"IF(Consolques=\"YES\",E77,F77)","v":"Table C1 Monthly Budget Statement Summary"},null,"Table C1 ",{"$f":"D77&\"Consolidated Monthly Budget Statement Summary\"","v":"Table C1 Consolidated Monthly Budget Statement Summary"},{"$f":"D77&\"Monthly Budget Statement Summary\"","v":"Table C1 Monthly Budget Statement Summary"}]
["S71C","Table C3 Monthly Budget Statement - Financial Performance (revenue and expenditure by municipal vote)",null,"Table C3 ",{"$f":"D78&\"Consolidated Monthly Budget Statement - Financial Performance (revenue and expenditure by municipal vote) \"","v":"Table C3 Consolidated Monthly Budget Statement - Financial Performance (revenue and expenditure by municipal vote) "},{"$f":"D78&\"Monthly Budget Statement - Financial Performance (revenue and expenditure by municipal vote)\"","v":"Table C3 Monthly Budget Statement - Financial Performance (revenue and expenditure by municipal vote)"}]
["S71A",{"$f":"IF(Consolques=\"YES\",E79,F79)","v":"Table C2 Monthly Budget Statement - Financial Performance (standard classification)"},null,"Table C2 ",{"$f":"D79&\"Consolidated Monthly Budget Statement - Financial Performance (standard classification) \"","v":"Table C2 Consolidated Monthly Budget Statement - Financial Performance (standard classification) "},{"$f":"D79&\"Monthly Budget Statement - Financial Performance (standard classification)\"","v":"Table C2 Monthly Budget Statement - Financial Performance (standard classification)"}]
["S71B",{"$f":"IF(Consolques=\"YES\",E80,F80)","v":"Table C4 Monthly Budget Statement - Financial Performance (revenue and expenditure)"},null,"Table C4 ",{"$f":"D80&\"Consolidated Monthly Budget Statement - Financial Performance (revenue and expenditure) \"","v":"Table C4 Consolidated Monthly Budget Statement - Financial Performance (revenue and expenditure) "},{"$f":"D80&\"Monthly Budget Statement - Financial Performance (revenue and expenditure)\"","v":"Table C4 Monthly Budget Statement - Financial Performance (revenue and expenditure)"}]
["S71D",{"$f":"IF(Consolques=\"YES\",E81,F81)","v":"Table C5 Monthly Budget Statement - Capital Expenditure (municipal vote, standard classification and funding)"},null,"Table C5 ",{"$f":"D81&\"Consolidated Monthly Budget Statement - Capital Expenditure (municipal vote, standard classification and funding \"","v":"Table C5 Consolidated Monthly Budget Statement - Capital Expenditure (municipal vote, standard classification and funding "},{"$f":"D81&\"Monthly Budget Statement - Capital Expenditure (municipal vote, standard classification and funding)\"","v":"Table C5 Monthly Budget Statement - Capital Expenditure (municipal vote, standard classification and funding)"}]
["S71E","Table C6 Monthly Budget Statement - Financial Position",null,"Table C6 ",{"$f":"D82&\"Consolidated Monthly Budget Statement - Financial Position \"","v":"Table C6 Consolidated Monthly Budget Statement - Financial Position "},{"$f":"D82&\"Monthly Budget Statement - Financial Position\"","v":"Table C6 Monthly Budget Statement - Financial Position"}]
["S71F","Table C7 Monthly Budget Statement - Cash Flow ",null,"Table C7 ",{"$f":"D83&\"Consolidated Monthly Budget Statement - Cash Flow \"","v":"Table C7 Consolidated Monthly Budget Statement - Cash Flow "},{"$f":"D83&\"Monthly Budget Statement - Cash Flow \"","v":"Table C7 Monthly Budget Statement - Cash Flow "}]
["S71G",{"$f":"D84&\"Material variance explanations \"","v":"Supporting Table SC1 Material variance explanations "},null,"Supporting Table SC1 "]
["S71H",{"$f":"D85&\"Monthly Budget Statement - performance indicators  \"","v":"Supporting Table SC2 Monthly Budget Statement - performance indicators  "},null,"Supporting Table SC2 "]
["S71I",{"$f":"D86&\"Monthly Budget Statement - aged debtors\"","v":"Supporting Table SC3 Monthly Budget Statement - aged debtors"},null,"Supporting Table SC3 "]
["S71J",{"$f":"D87&\"Monthly Budget Statement - aged creditors \"","v":"Supporting Table SC4 Monthly Budget Statement - aged creditors "},null,"Supporting Table SC4 "]
["S71K",{"$f":"D88&\"Monthly Budget Statement - investment portfolio \"","v":"Supporting Table SC5 Monthly Budget Statement - investment portfolio "},null,"Supporting Table SC5 "]
["S71L",{"$f":"D89&\"Monthly Budget Statement - transfers and grant receipts \"","v":"Supporting Table SC6 Monthly Budget Statement - transfers and grant receipts "},null,"Supporting Table SC6 "]
["S71M",{"$f":"D90&\" Monthly Budget Statement - transfers and grant expenditure \"","v":"Supporting Table SC7(1) Monthly Budget Statement - transfers and grant expenditure "},null,"Supporting Table SC7(1)"]
["S71N",{"$f":"D91&\"Monthly Budget Statement - councillor and staff benefits \"","v":"Supporting Table SC8 Monthly Budget Statement - councillor and staff benefits "},null,"Supporting Table SC8 "]
["S71O",{"$f":"D92&\"Monthly Budget Statement - actuals and revised targets for cash receipts\"","v":"Supporting Table SC9 Monthly Budget Statement - actuals and revised targets for cash receipts"},null,"Supporting Table SC9 "]
["S71P",{"$f":"IF(Consolques=\"YES\",E93,F93)","v":"NOT REQUIRED - municipality does not have entities or this is the parent municipality's budget"},null,"Supporting Table SC10 ",{"$f":"D93&\"Monthly Budget Statement  - Parent Municipality Financial Performance (revenue and expenditure) \"","v":"Supporting Table SC10 Monthly Budget Statement  - Parent Municipality Financial Performance (revenue and expenditure) "},"NOT REQUIRED - municipality does not have entities or this is the parent municipality's budget"]
["S71Q","NOT REQUIRED - municipality does not have entities or this is the parent municipality's budget",null,"Supporting Table SC11 ",{"$f":"D94&\"Monthly Budget Statement - summary of municipal entities\"","v":"Supporting Table SC11 Monthly Budget Statement - summary of municipal entities"},"NOT REQUIRED - municipality does not have entities or this is the parent municipality's budget"]
["S71R","Supporting Table SC12 Monthly Budget Statement - capital expenditure trend",null,"Supporting Table SC12 ",{"$f":"D95&\"Consolidated Monthly Budget Statement - capital expenditure trend \"","v":"Supporting Table SC12 Consolidated Monthly Budget Statement - capital expenditure trend "},{"$f":"D95&\"Monthly Budget Statement - capital expenditure trend\"","v":"Supporting Table SC12 Monthly Budget Statement - capital expenditure trend"}]
["S71Sa","Supporting Table SC13a Monthly Budget Statement - capital expenditure on new assets by asset class",null,"Supporting Table SC13a ",{"$f":"D96&\"Consolidated Monthly Budget Statement - capital expenditure on new assets by asset class\"","v":"Supporting Table SC13a Consolidated Monthly Budget Statement - capital expenditure on new assets by asset class"},{"$f":"D96&\"Monthly Budget Statement - capital expenditure on new assets by asset class\"","v":"Supporting Table SC13a Monthly Budget Statement - capital expenditure on new assets by asset class"}]
["S71Sb","Supporting Table SC13b Monthly Budget Statement - capital expenditure on renewal of existing assets by asset class",null,"Supporting Table SC13b ",{"$f":"D97&\"Consolidated Monthly Budget Statement - capital expenditure on renewal of existing assets by asset class\"","v":"Supporting Table SC13b Consolidated Monthly Budget Statement - capital expenditure on renewal of existing assets by asset class"},{"$f":"D97&\"Monthly Budget Statement - capital expenditure on renewal of existing assets by asset class\"","v":"Supporting Table SC13b Monthly Budget Statement - capital expenditure on renewal of existing assets by asset class"}]
["S71Sc","Supporting Table SC13c Monthly Budget Statement - expenditure on repairs and maintenance by asset class",null,"Supporting Table SC13c ",{"$f":"D98&\"Consolidated Monthly Budget Statement - expenditure on repairs and maintenance by asset class\"","v":"Supporting Table SC13c Consolidated Monthly Budget Statement - expenditure on repairs and maintenance by asset class"},{"$f":"D98&\"Monthly Budget Statement - expenditure on repairs and maintenance by asset class\"","v":"Supporting Table SC13c Monthly Budget Statement - expenditure on repairs and maintenance by asset class"}]
["S71Sd","Supporting Table SC13d Monthly Budget Statement - depreciation by asset class",null,"Supporting Table SC13d ",{"$f":"D99&\"Consolidated Monthly Budget Statement - depreciation by asset class\"","v":"Supporting Table SC13d Consolidated Monthly Budget Statement - depreciation by asset class"},{"$f":"D99&\"Monthly Budget Statement - depreciation by asset class\"","v":"Supporting Table SC13d Monthly Budget Statement - depreciation by asset class"}]
[null,"s71 charts listing"]
[null,{"$f":"D101&Head2A&\" Capital Expenditure Monthly Trend: actual v target\"","v":"Chart C1 2015/16 Capital Expenditure Monthly Trend: actual v target"},null,"Chart C1 "]
[null,{"$f":"D102&Head2A&\" Capital Expenditure: YTD actual v YTD target\"","v":"Chart C2 2015/16 Capital Expenditure: YTD actual v YTD target"},null,"Chart C2 "]
[null,{"$f":"D103&\"Aged Consumer Debtors Analysis\"","v":"Chart C3 Aged Consumer Debtors Analysis"},null,"Chart C3 "]
[null,{"$f":"D104&\"Consumer Debtors (total by Debtor Customer Category)\"","v":"Chart C4 Consumer Debtors (total by Debtor Customer Category)"},null,"Chart C4 "]
[null,{"$f":"D105&\"Aged Creditors Analysis\"","v":"Chart C5 Aged Creditors Analysis"},null,"Chart C5 "]
["S71T",{"$f":"D106&\" Monthly Budget Statement - Expenditure against approved rollovers\"","v":"Supporting Table SC7(2) Monthly Budget Statement - Expenditure against approved rollovers"},null,"Supporting Table SC7(2)"]

{"sheet":"Lookup and lists","index":3,"n_rows":307,"n_cols":22,"rows_kept":307,"cut":false,"hidden":true,"merged":[]}
["Description",2007,2008,2009,2010,2011,2012,2013,2014,2015,2016,2017,2018,2019,2020,null,"Grants:","National - opex","Provincial - opex","National - capex","Provincial - capex","YESNO"]
[{"$f":"'Template names'!C2","v":"Prior year -1"},"2006/07","2007/08","2008/09",{"$f":"E1-1&\"/\"&RIGHT(E1,2)-0","v":"2009/10"},{"$f":"F1-1&\"/\"&RIGHT(F1,2)-0","v":"2010/11"},"2011/12","2012/13","2013/14","2014/15","2015/16","2016/17","2017/18","2018/19","2019/20",null,null,"Local Government Equitable Share","Health subsidy","Municipal Infrastructure Grant (MIG)","Agriculture","Yes"]
[{"$f":"'Template names'!C5","v":"MTREF header name"},"2007/08 Medium Term Revenue & Expenditure Framework","2008/09 Medium Term Revenue & Expenditure Framework","2009/10 Medium Term Revenue & Expenditure Framework",{"$f":"E1&\"/\"&RIGHT(E1,2)+1&\" Medium Term Revenue & Expenditure Framework\"","v":"2010/11 Medium Term Revenue & Expenditure Framework"},{"$f":"F1&\"/\"&RIGHT(F1,2)+1&\" Medium Term Revenue & Expenditure Framework\"","v":"2011/12 Medium Term Revenue & Expenditure Framework"},"2012/13 Medium Term Revenue & Expenditure Framework","2013/14 Medium Term Revenue & Expenditure Framework","2014/15 Medium Term Revenue & Expenditure Framework","2015/16 Medium Term Revenue & Expenditure Framework","2016/17 Medium Term Revenue & Expenditure Framework","2017/18 Medium Term Revenue & Expenditure Framework","2018/19 Medium Term Revenue & Expenditure Framework","2019/20 Medium Term Revenue & Expenditure Framework","2020/21 Medium Term Revenue & Expenditure Framework",null,null,"RSC Levy Replacement ","Ambulance subsidy","Public Transport and Systems","Education","No"]
[{"$f":"'Template names'!C4","v":"Approved budget year"},"2007/08","2008/09","2009/10",{"$f":"E1&\"/\"&RIGHT(E1,2)+1","v":"2010/11"},{"$f":"F1&\"/\"&RIGHT(F1,2)+1","v":"2011/12"},"2012/13","2013/14","2014/15","2015/16","2016/17","2017/18","2018/19","2019/20","2020/21",null,null,"Finance Management ","Housing","Rural Transport Services and Infrastructure","Health"]
[{"$f":"'Template names'!C12","v":"1st year of MTREF"},"Budget Year 2007/08","Budget Year 2008/09","Budget Year 2009/10",{"$f":"\"Budget Year \"&E1&\"/\"&RIGHT(E1,2)+1","v":"Budget Year 2010/11"},{"$f":"\"Budget Year \"&F1&\"/\"&RIGHT(F1,2)+1","v":"Budget Year 2011/12"},"Budget Year 2012/13","Budget Year 2013/14","Budget Year 2014/15","Budget Year 2015/16","Budget Year 2016/17","Budget Year 2017/18","Budget Year 2018/19","Budget Year 2019/20","Budget Year 2020/21",null,null,"Municipal Systems Improvement","Sport and Recreation","Regional Bulk Infrastructure","Housing and Local Government "]
[{"$f":"'Template names'!C13","v":"2nd year of MTREF"},"Budget Year +1 2008/09","Budget Year +1 2009/10","Budget Year +1 2010/11",{"$f":"\"Budget Year +1 \"&E1+1&\"/\"&RIGHT(E1,2)+2","v":"Budget Year +1 2011/12"},{"$f":"\"Budget Year +1 \"&F1+1&\"/\"&RIGHT(F1,2)+2","v":"Budget Year +1 2012/13"},"Budget Year +1 2013/14","Budget Year +1 2014/15","Budget Year +1 2015/16","Budget Year +1 2016/17","Budget Year +1 2017/18","Budget Year +1 2018/19","Budget Year +1 2019/20","Budget Year +1 2020/21","Budget Year +1 2021/22",null,null,"Water Services Operating Subsidy ",null,"Rural Households Infrastructure ","Other Departments"]
[{"$f":"'Template names'!C14","v":"3rd year of MTREF"},"Budget Year +2 2009/10","Budget Year +2 2010/11","Budget Year +2 2011/12",{"$f":"\"Budget Year +2 \"&E1+2&\"/\"&RIGHT(E1,2)+3","v":"Budget Year +2 2012/13"},{"$f":"\"Budget Year +2 \"&F1+2&\"/\"&RIGHT(F1,2)+3","v":"Budget Year +2 2013/14"},"Budget Year +2 2014/15","Budget Year +2 2015/16","Budget Year +2 2016/17","Budget Year +2 2017/18","Budget Year +2 2018/19","Budget Year +2 2019/20","Budget Year +2 2020/21","Budget Year +2 2021/22","Budget Year +2 2022/23",null,null,"Energy Efficiency  and Demand Management",null,"Neighbourhood Development Partnership","Public Works, Roads, Transport "]
["NOTE: This sheet should not be directly amended - select headings from sheet 'S'",null,null,null,null,null,null,null,null,null,null,null,null,null,null,null,null,"Integrated National Electrification Programme",null,"2010 FIFA World Cup Stadiums Development","Sport and Recreation"]
[null,null,null,null,null,null,null,null,null,null,null,null,null,null,null,null,null,"Municipal Drought Relief "]
[null,null,null,null,null,null,null,null,null,null,null,null,null,null,null,null,null,"2010 FIFA World Cup Operating"]
[null,null,null,null,null,null,null,null,null,null,null,null,null,null,null,null,null,"Electricity Demand Side Management"]
[null,null,null,null,null,null,null,null,null,null,null,null,null,null,null,null,null,"EPWP Incentive"]
[]
[]
[]
[]
[]
[]
[]
[]
[]
[]
[]
[]
[]
["Name link",56]
["Name of Muni",{"$f":"INDEX(B28:B311,B26,1)","v":"FS184 Matjhabeng"}]
[null,"Choose name from list","Set name on 'Instructions' sheet"]
[null,"BUF Buffalo City","EC EASTERN CAPE"]
[null,"NMA Nelson Mandela Bay","EC EASTERN CAPE"]
[null,"EC101 Camdeboo","EC EASTERN CAPE"]
[null,"EC102 Blue Crane Route","EC EASTERN CAPE"]
[null,"EC103 Ikwezi","EC EASTERN CAPE"]
[null,"EC104 Makana","EC EASTERN CAPE"]
[null,"EC105 Ndlambe","EC EASTERN CAPE"]
[null,"EC106 Sundays River Valley","EC EASTERN CAPE"]
[null,"EC107 Baviaans","EC EASTERN CAPE"]
[null,"EC108 Kouga","EC EASTERN CAPE"]
[null,"EC109 Kou-Kamma","EC EASTERN CAPE"]
[null,"DC10 Cacadu","EC EASTERN CAPE"]
[null,"EC121 Mbhashe","EC EASTERN CAPE"]
[null,"EC122 Mnquma","EC EASTERN CAPE"]
[null,"EC123 Great Kei","EC EASTERN CAPE"]
[null,"EC124 Amahlathi","EC EASTERN CAPE"]
[null,"EC126 Ngqushwa","EC EASTERN CAPE"]
[null,"EC127 Nkonkobe","EC EASTERN CAPE"]
[null,"EC128 Nxuba","EC EASTERN CAPE"]
[null,"DC12 Amathole","EC EASTERN CAPE"]
[null,"EC131 Inxuba Yethemba","EC EASTERN CAPE"]
[null,"EC132 Tsolwana","EC EASTERN CAPE"]
[null,"EC133 Inkwanca","EC EASTERN CAPE"]
[null,"EC134 Lukhanji","EC EASTERN CAPE"]
[null,"EC135 Intsika Yethu","EC EASTERN CAPE"]
[null,"EC136 Emalahleni (Ec)","EC EASTERN CAPE"]
[null,"EC137 Engcobo","EC EASTERN CAPE"]
[null,"EC138 Sakhisizwe","EC EASTERN CAPE"]
[null,"DC13 Chris Hani","EC EASTERN CAPE"]
[null,"EC141 Elundini","EC EASTERN CAPE"]
[null,"EC142 Senqu","EC EASTERN CAPE"]
[null,"EC143 Maletswai","EC EASTERN CAPE"]
[null,"EC144 Gariep","EC EASTERN CAPE"]
[null,"DC14 Joe Gqabi","EC EASTERN CAPE"]
[null,"EC153 Ngquza Hills","EC EASTERN CAPE"]
[null,"EC154 Port St Johns","EC EASTERN CAPE"]
[null,"EC155 Nyandeni","EC EASTERN CAPE"]
[null,"EC156 Mhlontlo","EC EASTERN CAPE"]
[null,"EC157 King Sabata Dalindyebo","EC EASTERN CAPE"]
[null,"DC15 O .R. Tambo","EC EASTERN CAPE"]
[null,"EC441 Matatiele","EC EASTERN CAPE"]
[null,"EC442 Umzimvubu","EC EASTERN CAPE"]
[null,"EC443 Mbizana","EC EASTERN CAPE"]
[null,"EC444 Ntabankulu","EC EASTERN CAPE"]
[null,"DC44 Alfred Nzo","EC EASTERN CAPE"]
[null,"MAN Mangaung","FS FREE STATE"]
[null,"FS161 Letsemeng","FS FREE STATE"]
[null,"FS162 Kopanong","FS FREE STATE"]
[null,"FS163 Mohokare","FS FREE STATE"]
[null,"FS164 Naledi (Fs)","FS FREE STATE"]
[null,"DC16 Xhariep","FS FREE STATE"]
[null,"FS181 Masilonyana","FS FREE STATE"]
[null,"FS182 Tokologo","FS FREE STATE"]
[null,"FS183 Tswelopele","FS FREE STATE"]
[null,"FS184 Matjhabeng","FS FREE STATE"]
[null,"FS185 Nala","FS FREE STATE"]
[null,"DC18 Lejweleputswa","FS FREE STATE"]
[null,"FS191 Setsoto","FS FREE STATE"]
[null,"FS192 Dihlabeng","FS FREE STATE"]
[null,"FS193 Nketoana","FS FREE STATE"]
[null,"FS194 Maluti-a-Phofung","FS FREE STATE"]
[null,"FS195 Phumelela","FS FREE STATE"]
[null,"FS196 Mantsopa","FS FREE STATE"]
[null,"DC19 Thabo Mofutsanyana","FS FREE STATE"]
[null,"FS201 Moqhaka","FS FREE STATE"]
[null,"FS203 Ngwathe","FS FREE STATE"]
[null,"FS204 Metsimaholo","FS FREE STATE"]
[null,"FS205 Mafube","FS FREE STATE"]
[null,"DC20 Fezile Dabi","FS FREE STATE"]
[null,"EKU Ekurhuleni Metro","GT GAUTENG"]
[null,"JHB City Of Johannesburg","GT GAUTENG"]
[null,"TSH City Of Tshwane","GT GAUTENG"]
[null,"GT421 Emfuleni","GT GAUTENG"]
[null,"GT422 Midvaal","GT GAUTENG"]
[null,"GT423 Lesedi","GT GAUTENG"]
[null,"DC42 Sedibeng","GT GAUTENG"]
[null,"GT481 Mogale City","GT GAUTENG"]
[null,"GT482 Randfontein","GT GAUTENG"]
[null,"GT483 Westonaria","GT GAUTENG"]
[null,"GT484 Merafong City","GT GAUTENG"]
[null,"DC48 West Rand","GT GAUTENG"]
[null,"ETH eThekwini","KZN KWAZULU-NATAL"]
[null,"KZN211 Vulamehlo","KZN KWAZULU-NATAL"]
[null,"KZN212 Umdoni","KZN KWAZULU-NATAL"]
[null,"KZN213 Umzumbe","KZN KWAZULU-NATAL"]
[null,"KZN214 uMuziwabantu","KZN KWAZULU-NATAL"]
[null,"KZN215 Ezinqoleni","KZN KWAZULU-NATAL"]
[null,"KZN216 Hibiscus Coast","KZN KWAZULU-NATAL"]
[null,"DC21 Ugu","KZN KWAZULU-NATAL"]
[null,"KZN221 uMshwathi","KZN KWAZULU-NATAL"]
[null,"KZN222 uMngeni","KZN KWAZULU-NATAL"]
[null,"KZN223 Mpofana","KZN KWAZULU-NATAL"]
[null,"KZN224 Impendle","KZN KWAZULU-NATAL"]
[null,"KZN225 Msunduzi","KZN KWAZULU-NATAL"]
[null,"KZN226 Mkhambathini","KZN KWAZULU-NATAL"]
[null,"KZN227 Richmond","KZN KWAZULU-NATAL"]
[null,"DC22 uMgungundlovu","KZN KWAZULU-NATAL"]
[null,"KZN232 Emnambithi/Ladysmith","KZN KWAZULU-NATAL"]
[null,"KZN233 Indaka","KZN KWAZULU-NATAL"]
[null,"KZN234 Umtshezi","KZN KWAZULU-NATAL"]
[null,"KZN235 Okhahlamba","KZN KWAZULU-NATAL"]
[null,"KZN236 Imbabazane","KZN KWAZULU-NATAL"]
[null,"DC23 Uthukela","KZN KWAZULU-NATAL"]
[null,"KZN241 Endumeni","KZN KWAZULU-NATAL"]
[null,"KZN242 Nquthu","KZN KWAZULU-NATAL"]
[null,"KZN244 Msinga","KZN KWAZULU-NATAL"]
[null,"KZN245 Umvoti","KZN KWAZULU-NATAL"]
[null,"DC24 Umzinyathi","KZN KWAZULU-NATAL"]
[null,"KZN252 Newcastle","KZN KWAZULU-NATAL"]
[null,"KZN253 eMadlangeni","KZN KWAZULU-NATAL"]
[null,"KZN254 Dannhauser","KZN KWAZULU-NATAL"]
[null,"DC25 Amajuba","KZN KWAZULU-NATAL"]
[null,"KZN261 eDumbe","KZN KWAZULU-NATAL"]
[null,"KZN262 uPhongolo","KZN KWAZULU-NATAL"]
[null,"KZN263 Abaqulusi","KZN KWAZULU-NATAL"]
[null,"KZN265 Nongoma","KZN KWAZULU-NATAL"]
[null,"KZN266 Ulundi","KZN KWAZULU-NATAL"]
[null,"DC26 Zululand","KZN KWAZULU-NATAL"]
[null,"KZN271 Umhlabuyalingana","KZN KWAZULU-NATAL"]
[null,"KZN272 Jozini","KZN KWAZULU-NATAL"]
[null,"KZN273 The Big 5 False Bay","KZN KWAZULU-NATAL"]
[null,"KZN274 Hlabisa","KZN KWAZULU-NATAL"]
[null,"KZN275 Mtubatuba","KZN KWAZULU-NATAL"]
[null,"DC27 Umkhanyakude","KZN KWAZULU-NATAL"]
[null,"KZN281 Mfolozi","KZN KWAZULU-NATAL"]
[null,"KZN282 uMhlathuze","KZN KWAZULU-NATAL"]
[null,"KZN283 Ntambanana","KZN KWAZULU-NATAL"]
[null,"KZN284 uMlalazi","KZN KWAZULU-NATAL"]
[null,"KZN285 Mthonjaneni","KZN KWAZULU-NATAL"]
[null,"KZN286 Nkandla","KZN KWAZULU-NATAL"]
[null,"DC28 uThungulu","KZN KWAZULU-NATAL"]
[null,"KZN291 Mandeni","KZN KWAZULU-NATAL"]
[null,"KZN292 KwaDukuza","KZN KWAZULU-NATAL"]
[null,"KZN293 Ndwedwe","KZN KWAZULU-NATAL"]
[null,"KZN294 Maphumulo","KZN KWAZULU-NATAL"]
[null,"DC29 iLembe","KZN KWAZULU-NATAL"]
[null,"KZN431 Ingwe","KZN KWAZULU-NATAL"]
[null,"KZN432 Kwa Sani","KZN KWAZULU-NATAL"]
[null,"KZN433 Greater Kokstad","KZN KWAZULU-NATAL"]
[null,"KZN434 Ubuhlebezwe","KZN KWAZULU-NATAL"]
[null,"KZN435 Umzimkhulu","KZN KWAZULU-NATAL"]
[null,"DC43 Sisonke","KZN KWAZULU-NATAL"]
[null,"LIM331 Greater Giyani","LIM LIMPOPO"]
[null,"LIM332 Greater Letaba","LIM LIMPOPO"]
[null,"LIM333 Greater Tzaneen","LIM LIMPOPO"]
[null,"LIM334 Ba-Phalaborwa","LIM LIMPOPO"]
[null,"LIM335 Maruleng","LIM LIMPOPO"]
[null,"DC33 Mopani","LIM LIMPOPO"]
[null,"LIM341 Musina","LIM LIMPOPO"]
[null,"LIM342 Mutale","LIM LIMPOPO"]
[null,"LIM343 Thulamela","LIM LIMPOPO"]
[null,"LIM344 Makhado","LIM LIMPOPO"]
[null,"DC34 Vhembe","LIM LIMPOPO"]
[null,"LIM351 Blouberg","LIM LIMPOPO"]
[null,"LIM352 Aganang","LIM LIMPOPO"]
[null,"LIM353 Molemole","LIM LIMPOPO"]
[null,"LIM354 Polokwane","LIM LIMPOPO"]
[null,"LIM355 Lepelle-Nkumpi","LIM LIMPOPO"]
[null,"DC35 Capricorn","LIM LIMPOPO"]
[null,"LIM361 Thabazimbi","LIM LIMPOPO"]
[null,"LIM362 Lephalale","LIM LIMPOPO"]
[null,"LIM364 Mookgopong","LIM LIMPOPO"]
[null,"LIM365 Modimolle","LIM LIMPOPO"]
[null,"LIM366 Bela Bela","LIM LIMPOPO"]
[null,"LIM367 Mogalakwena","LIM LIMPOPO"]
[null,"DC36 Waterberg","LIM LIMPOPO"]
[null,"LIM471 Ephraim Mogale","LIM LIMPOPO"]
[null,"LIM472 Elias Motsoaledi","LIM LIMPOPO"]
[null,"LIM473 Makhuduthamaga","LIM LIMPOPO"]
[null,"LIM474 Fetakgomo","LIM LIMPOPO"]
[null,"LIM475 Greater Tubatse","LIM LIMPOPO"]
[null,"DC47 Sekhukhune","LIM LIMPOPO"]
[null,"MP301 Albert Luthuli","MP MPUMALANGA"]
[null,"MP302 Msukaligwa","MP MPUMALANGA"]
[null,"MP303 Mkhondo","MP MPUMALANGA"]
[null,"MP304 Pixley Ka Seme (MP)","MP MPUMALANGA"]
[null,"MP305 Lekwa","MP MPUMALANGA"]
[null,"MP306 Dipaleseng","MP MPUMALANGA"]
[null,"MP307 Govan Mbeki","MP MPUMALANGA"]
[null,"DC30 Gert Sibande","MP MPUMALANGA"]
[null,"MP311 Victor Khanye","MP MPUMALANGA"]
[null,"MP312 Emalahleni (Mp)","MP MPUMALANGA"]
[null,"MP313 Steve Tshwete","MP MPUMALANGA"]
[null,"MP314 Emakhazeni","MP MPUMALANGA"]
[null,"MP315 Thembisile Hani","MP MPUMALANGA"]
[null,"MP316 Dr J.S. Moroka","MP MPUMALANGA"]
[null,"DC31 Nkangala","MP MPUMALANGA"]
[null,"MP321 Thaba Chweu","MP MPUMALANGA"]
[null,"MP322 Mbombela","MP MPUMALANGA"]
[null,"MP323 Umjindi","MP MPUMALANGA"]
[null,"MP324 Nkomazi","MP MPUMALANGA"]
[null,"MP325 Bushbuckridge","MP MPUMALANGA"]
[null,"DC32 Ehlanzeni","MP MPUMALANGA"]
[null,"NW371 Moretele","NW NORTH WEST"]
[null,"NW372 Madibeng","NW NORTH WEST"]
[null,"NW373 Rustenburg","NW NORTH WEST"]
[null,"NW374 Kgetlengrivier","NW NORTH WEST"]
[null,"NW375 Moses Kotane","NW NORTH WEST"]
[null,"DC37 Bojanala Platinum","NW NORTH WEST"]
[null,"NW381 Ratlou","NW NORTH WEST"]
[null,"NW382 Tswaing","NW NORTH WEST"]
[null,"NW383 Mafikeng","NW NORTH WEST"]
[null,"NW384 Ditsobotla","NW NORTH WEST"]
[null,"NW385 Ramotshere Moiloa","NW NORTH WEST"]
[null,"DC38 Ngaka Modiri Molema","NW NORTH WEST"]
[null,"NW392 Naledi (Nw)","NW NORTH WEST"]
[null,"NW393 Mamusa","NW NORTH WEST"]
[null,"NW394 Greater Taung","NW NORTH WEST"]
[null,"NW396 Lekwa-Teemane","NW NORTH WEST"]
[null,"NW397 Molopo-Kagisano","NW NORTH WEST"]
[null,"DC39 Dr Ruth Segomotsi Mompati","NW NORTH WEST"]
[null,"NW401 Ventersdorp","NW NORTH WEST"]
[null,"NW402 Tlokwe","NW NORTH WEST"]
[null,"NW403 City Of Matlosana","NW NORTH WEST"]
[null,"NW404 Maquassi Hills","NW NORTH WEST"]
[null,"DC40 Dr Kenneth Kaunda","NW NORTH WEST"]
[null,"NC451 Joe Morolong","NC NORTHERN CAPE"]
[null,"NC452 Ga-Segonyana","NC NORTHERN CAPE"]
[null,"NC453 Gamagara","NC NORTHERN CAPE"]
[null,"DC45 John Taolo Gaetsewe","NC NORTHERN CAPE"]
[null,"NC061 Richtersveld","NC NORTHERN CAPE"]
[null,"NC062 Nama Khoi","NC NORTHERN CAPE"]
[null,"NC064 Kamiesberg","NC NORTHERN CAPE"]
[null,"NC065 Hantam","NC NORTHERN CAPE"]
[null,"NC066 Karoo Hoogland","NC NORTHERN CAPE"]
[null,"NC067 Khai-Ma","NC NORTHERN CAPE"]
[null,"DC6 Namakwa","NC NORTHERN CAPE"]
[null,"NC071 Ubuntu","NC NORTHERN CAPE"]
[null,"NC072 Umsobomvu","NC NORTHERN CAPE"]
[null,"NC073 Emthanjeni","NC NORTHERN CAPE"]
[null,"NC074 Kareeberg","NC NORTHERN CAPE"]
[null,"NC075 Renosterberg","NC NORTHERN CAPE"]
[null,"NC076 Thembelihle","NC NORTHERN CAPE"]
[null,"NC077 Siyathemba","NC NORTHERN CAPE"]
[null,"NC078 Siyancuma","NC NORTHERN CAPE"]
[null,"DC7 Pixley Ka Seme (Nc)","NC NORTHERN CAPE"]
[null,"NC081 Mier","NC NORTHERN CAPE"]
[null,"NC082 !Kai! Garib","NC NORTHERN CAPE"]
[null,"NC083 //Khara Hais","NC NORTHERN CAPE"]
[null,"NC084 !Kheis","NC NORTHERN CAPE"]
[null,"NC085 Tsantsabane","NC NORTHERN CAPE"]
[null,"NC086 Kgatelopele","NC NORTHERN CAPE"]
[null,"DC8 Siyanda","NC NORTHERN CAPE"]
[null,"NC091 Sol Plaatje","NC NORTHERN CAPE"]
[null,"NC092 Dikgatlong","NC NORTHERN CAPE"]
[null,"NC093 Magareng","NC NORTHERN CAPE"]
[null,"NC094 Phokwane","NC NORTHERN CAPE"]
[null,"DC9 Frances Baard","NC NORTHERN CAPE"]
[null,"CPT Cape Town","WC WESTERN CAPE"]
[null,"WC011 Matzikama","WC WESTERN CAPE"]
[null,"WC012 Cederberg","WC WESTERN CAPE"]
[null,"WC013 Bergrivier","WC WESTERN CAPE"]
[null,"WC014 Saldanha Bay","WC WESTERN CAPE"]
[null,"WC015 Swartland","WC WESTERN CAPE"]
[null,"DC1 West Coast","WC WESTERN CAPE"]
[null,"WC022 Witzenberg","WC WESTERN CAPE"]
[null,"WC023 Drakenstein","WC WESTERN CAPE"]
[null,"WC024 Stellenbosch","WC WESTERN CAPE"]
[null,"WC025 Breede Valley","WC WESTERN CAPE"]
[null,"WC026 Langeberg","WC WESTERN CAPE"]
[null,"DC2 Cape Winelands DM","WC WESTERN CAPE"]
[null,"WC031 Theewaterskloof","WC WESTERN CAPE"]
[null,"WC032 Overstrand","WC WESTERN CAPE"]
[null,"WC033 Cape Agulhas","WC WESTERN CAPE"]
[null,"WC034 Swellendam","WC WESTERN CAPE"]
[null,"DC3 Overberg","WC WESTERN CAPE"]
[null,"WC041 Kannaland","WC WESTERN CAPE"]
[null,"WC042 Hessequa","WC WESTERN CAPE"]
[null,"WC043 Mossel Bay","WC WESTERN CAPE"]
[null,"WC044 George","WC WESTERN CAPE"]
[null,"WC045 Oudtshoorn","WC WESTERN CAPE"]
[null,"WC047 Bitou","WC WESTERN CAPE"]
[null,"WC048 Knysna","WC WESTERN CAPE"]
[null,"DC4 Eden","WC WESTERN CAPE"]
[null,"WC051 Laingsburg","WC WESTERN CAPE"]
[null,"WC052 Prince Albert","WC WESTERN CAPE"]
[null,"WC053 Beaufort West","WC WESTERN CAPE"]
[null,"DC5 Central Karoo","WC WESTERN CAPE"]
[null,null,{"$f":"COUNTA(C29:C306)","v":278}]

{"sheet":"Org structure","index":4,"n_rows":166,"n_cols":5,"rows_kept":166,"cut":false,"hidden":false,"merged":[]}
["Organisational Structure Votes",null,"Organisational Structure Sub-Votes",null,"Display Sub-Votes"]
[{"$f":"B2&\" - \"&C2","v":"Vote 1 - COUNCIL GENERAL"},"Vote 1","COUNCIL GENERAL"]
[{"$f":"B13&\" - \"& C13","v":"Vote 2 - OFFICE OF THE EXECUTIVE MAYOR"},1.1000000000000001,"Council",{"$f":"CONCATENATE(B3, \" - \", C3)","v":"1.1 - Council"},"1.1 - Council"]
[{"$f":"B24&\" - \"&C24","v":"Vote 3 - OFFICE OF THE SPEAKER"},1.2,"[Name of sub-vote]","1.2 - [Name of sub-vote]"]
[{"$f":"B35&\" - \"&C35","v":"Vote 4 - OFFICE OF THE MUNICIPAL MANAGER"},1.3,"[Name of sub-vote]","1.3 - [Name of sub-vote]"]
[{"$f":"B46&\" - \"&C46","v":"Vote 5 - CORPORATE SUPPORT SERVICES"},1.4,"[Name of sub-vote]","1.4 - [Name of sub-vote]"]
[{"$f":"B57&\" - \"&C57","v":"Vote 6 - FINANCE"},1.5,"[Name of sub-vote]","1.5 - [Name of sub-vote]"]
[{"$f":"B68&\" - \"&C68","v":"Vote 7 - HUMAN RESOURCES"},1.6,"[Name of sub-vote]","1.6 - [Name of sub-vote]"]
[{"$f":"B79&\" - \"&C79","v":"Vote 8 - COMMUNITY SERVICES"},1.7,"[Name of sub-vote]","1.7 - [Name of sub-vote]"]
[{"$f":"B90&\" - \"&C90","v":"Vote 9 - PUBLIC SAFETY AND TRANSPORT"},1.8,"[Name of sub-vote]","1.8 - [Name of sub-vote]"]
[{"$f":"B101&\" - \"&C101","v":"Vote 10 - ECONOMIC DEVELOPMENT"},1.9,"[Name of sub-vote]","1.9 - [Name of sub-vote]"]
[{"$f":"B112&\" - \"&C112","v":"Vote 11 - ENGINEERING SERVICES"},"1.10","[Name of sub-vote]","1.10 - [Name of sub-vote]"]
[{"$f":"B123&\" - \"&C123","v":"Vote 12 - WATER"},"Vote 2","OFFICE OF THE EXECUTIVE MAYOR"]
[{"$f":"B134&\" - \"&C134","v":"Vote 13 - ELECTRICITY"},2.1,"Executive Mayor",{"$f":"CONCATENATE(B14, \" - \", C14)","v":"2.1 - Executive Mayor"},"2.1 - Executive Mayor"]
[{"$f":"B145&\" - \"&C145","v":"Vote 14 - MECHANICAL WORKSHOP"},2.2000000000000002,"Mayoral Committee","2.2 - Mayoral Committee","2.2 - Mayoral Committee"]
[{"$f":"B156&\" - \"&C156","v":"Vote 15 - HOUSING SERVICES"},2.2999999999999998,"[Name of sub-vote]","2.3 - [Name of sub-vote]"]
[null,2.4,"[Name of sub-vote]","2.4 - [Name of sub-vote]"]
[null,2.5,"[Name of sub-vote]","2.5 - [Name of sub-vote]"]
[null,2.6,"[Name of sub-vote]","2.6 - [Name of sub-vote]"]
[null,2.7,"[Name of sub-vote]","2.7 - [Name of sub-vote]"]
[null,2.8,"[Name of sub-vote]","2.8 - [Name of sub-vote]"]
[null,2.9,"[Name of sub-vote]","2.9 - [Name of sub-vote]"]
[null,"2.10","[Name of sub-vote]","2.10 - [Name of sub-vote]"]
[null,"Vote 3","OFFICE OF THE SPEAKER"]
[null,3.1,"Speaker",{"$f":"CONCATENATE(B25, \" - \", C25)","v":"3.1 - Speaker"},"3.1 - Speaker"]
[null,3.2,"Political Appointments","3.2 - Political Appointments","3.2 - Political Appointments"]
[null,3.3,"[Name of sub-vote]","3.3 - [Name of sub-vote]"]
[null,3.4,"[Name of sub-vote]","3.4 - [Name of sub-vote]"]
[null,3.5,"[Name of sub-vote]","3.5 - [Name of sub-vote]"]
[null,3.6,"[Name of sub-vote]","3.6 - [Name of sub-vote]"]
[null,3.7,"[Name of sub-vote]","3.7 - [Name of sub-vote]"]
[null,3.8,"[Name of sub-vote]","3.8 - [Name of sub-vote]"]
[null,3.9,"[Name of sub-vote]","3.9 - [Name of sub-vote]"]
[null,"3.10","[Name of sub-vote]","3.10 - [Name of sub-vote]"]
[null,"Vote 4","OFFICE OF THE MUNICIPAL MANAGER"]
[null,4.0999999999999996,"Municipal Manager",{"$f":"CONCATENATE(B36, \" - \", C36)","v":"4.1 - Municipal Manager"},"4.1 - Municipal Manager"]
[null,4.2,"IDP","4.2 - IDP","4.2 - IDP"]
[null,4.3,"Internal Audit","4.3 - Internal Audit","4.3 - Internal Audit"]
[null,4.4000000000000004,"Organisation & Workstudy","4.4 - Organisation & Workstudy","4.4 - Organisation & Workstudy"]
[null,4.5,"IT","4.5 - IT","4.5 - IT"]
[null,4.5999999999999996,"Legal Services","4.6 - Legal Services","4.6 - Legal Services"]
[null,4.7,"[Name of sub-vote]","4.7 - [Name of sub-vote]"]
[null,4.8,"[Name of sub-vote]","4.8 - [Name of sub-vote]"]
[null,4.9000000000000004,"[Name of sub-vote]","4.9 - [Name of sub-vote]"]
[null,"4.10","[Name of sub-vote]","4.10 - [Name of sub-vote]"]
[null,"Vote 5","CORPORATE SUPPORT SERVICES"]
[null,5.0999999999999996,"Corporate Services Admin",{"$f":"CONCATENATE(B47, \" - \", C47)","v":"5.1 - Corporate Services Admin"},"5.1 - Corporate Services Admin"]
[null,5.2,"Libraries","5.2 - Libraries","5.2 - Libraries"]
[null,5.3,"Halls & Offices","5.3 - Halls & Offices","5.3 - Halls & Offices"]
[null,5.4,"[Name of sub-vote]","5.4 - [Name of sub-vote]"]
[null,5.5,"[Name of sub-vote]","5.5 - [Name of sub-vote]"]
[null,5.6,"[Name of sub-vote]","5.6 - [Name of sub-vote]"]
[null,5.7,"[Name of sub-vote]","5.7 - [Name of sub-vote]"]
[null,5.8,"[Name of sub-vote]","5.8 - [Name of sub-vote]"]
[null,5.9,"[Name of sub-vote]","5.9 - [Name of sub-vote]"]
[null,"5.10","[Name of sub-vote]","5.10 - [Name of sub-vote]"]
[null,"Vote 6","FINANCE"]
[null,6.1,"Administration",{"$f":"CONCATENATE(B58, \" - \", C58)","v":"6.1 - Administration"},"6.1 - Administration"]
[null,6.2,"Expenditure","6.2 - Expenditure","6.2 - Expenditure"]
[null,6.3,"Budget Control & Salaries","6.3 - Budget Control & Salaries","6.3 - Budget Control & Salaries"]
[null,6.4,"Stores","6.4 - Stores","6.4 - Stores"]
[null,6.5,"Revenue","6.5 - Revenue","6.6 - Revenue"]
[null,6.6,"Fresh Produce Market","6.6 - Fresh Produce Market","6.7 - Fresh Produce Market"]
[null,6.7,"Valuation","6.7 - Valuation","6.8 - Valuation"]
[null,6.8,"Credit Contol","6.8 - Credit Contol","6.8 - Credit Contol"]
[null,6.9,"[Name of sub-vote]","6.9 - [Name of sub-vote]"]
[null,"6.10","[Name of sub-vote]","6.10 - [Name of sub-vote]"]
[null,"Vote 7","HUMAN RESOURCES"]
[null,7.1,"Administration",{"$f":"CONCATENATE(B69, \" - \", C69)","v":"7.1 - Administration"},"7.1 - Administration"]
[null,7.2,"Training","7.2 - Training","7.2 - Training"]
[null,7.3,"Health and Safety","7.3 - Health and Safety","7.3 - Health and Safety"]
[null,7.4,"[Name of sub-vote]","7.4 - [Name of sub-vote]"]
[null,7.5,"[Name of sub-vote]","7.5 - [Name of sub-vote]"]
[null,7.6,"[Name of sub-vote]","7.6 - [Name of sub-vote]"]
[null,7.7,"[Name of sub-vote]","7.7 - [Name of sub-vote]"]
[null,7.8,"[Name of sub-vote]","7.8 - [Name of sub-vote]"]
[null,7.9,"[Name of sub-vote]","7.9 - [Name of sub-vote]"]
[null,"7.10","[Name of sub-vote]","7.10 - [Name of sub-vote]"]
[null,"Vote 8","COMMUNITY SERVICES"]
[null,8.1,"Community Services Admin",{"$f":"CONCATENATE(B80, \" - \", C80)","v":"8.1 - Community Services Admin"},"8.1 - Community Services Admin"]
[null,8.1999999999999993,"Parks and Recreation","8.2 - Parks and Recreation","8.2 - Parks and Recreation"]
[null,8.3000000000000007,"Refuse","8.3 - Refuse","8.3 - Refuse"]
[null,8.4,"Enviromental Protection","8.4 - Enviromental Protection","8.4 - Enviromental Protection"]
[null,8.5,"[Name of sub-vote]","8.5 - [Name of sub-vote]"]
[null,8.6,"[Name of sub-vote]","8.6 - [Name of sub-vote]"]
[null,8.6999999999999993,"[Name of sub-vote]","8.7 - [Name of sub-vote]"]
[null,8.8000000000000007,"[Name of sub-vote]","8.8 - [Name of sub-vote]"]
[null,8.9,"[Name of sub-vote]","8.9 - [Name of sub-vote]"]
[null,"8.10","[Name of sub-vote]","8.10 - [Name of sub-vote]"]
[null,"Vote 9","PUBLIC SAFETY AND TRANSPORT"]
[null,9.1,"Traffic",{"$f":"CONCATENATE(B91, \" - \", C91)","v":"9.1 - Traffic"},"9.1 - Traffic"]
[null,9.1999999999999993,"Disaster Management","9.2 - Disaster Management","9.2 - Disaster Management"]
[null,9.3000000000000007,"Security","9.3 - Security","9.3 - Security"]
[null,9.4,"Fire Services","9.4 - Fire Services","9.4 - Fire Services"]
[null,9.5,"[Name of sub-vote]","9.5 - [Name of sub-vote]"]
[null,9.6,"[Name of sub-vote]","9.6 - [Name of sub-vote]"]
[null,9.6999999999999993,"[Name of sub-vote]","9.7 - [Name of sub-vote]"]
[null,9.8000000000000007,"[Name of sub-vote]","9.8 - [Name of sub-vote]"]
[null,9.9,"[Name of sub-vote]","9.9 - [Name of sub-vote]"]
[null,"9.10","[Name of sub-vote]","9.10 - [Name of sub-vote]"]
[null,"Vote 10","ECONOMIC DEVELOPMENT"]
[null,10.1,"Economic Development",{"$f":"CONCATENATE(B102, \" - \", C102)","v":"10.1 - Economic Development"},"10.1 - Economic Development"]
[null,10.199999999999999,"[Name of sub-vote]","10.2 - [Name of sub-vote]"]
[null,10.3,"[Name of sub-vote]","10.3 - [Name of sub-vote]"]
[null,10.4,"[Name of sub-vote]","10.4 - [Name of sub-vote]"]
[null,10.5,"[Name of sub-vote]","10.5 - [Name of sub-vote]"]
[null,10.6,"[Name of sub-vote]","10.6 - [Name of sub-vote]"]
[null,10.7,"[Name of sub-vote]","10.7 - [Name of sub-vote]"]
[null,10.8,"[Name of sub-vote]","10.8 - [Name of sub-vote]"]
[null,10.9,"[Name of sub-vote]","10.9 - [Name of sub-vote]"]
[null,"10.10","[Name of sub-vote]","10.10 - [Name of sub-vote]"]
[null,"Vote 11","ENGINEERING SERVICES"]
[null,11.1,"Building",{"$f":"CONCATENATE(B113, \" - \", C113)","v":"11.1 - Building"},"11.1 - Building"]
[null,11.2,"Engineering Administration","11.2 - Engineering Administration","11.2 - Engineering Administration"]
[null,11.3,"Engineering Planning","11.3 - Engineering Planning","11.3 - Engineering Planning"]
[null,11.4,"Engineering Surveying","11.4 - Engineering Surveying","11.4 - Engineering Surveying"]
[null,11.5,"Eng- Intern Serv Building Shop","11.5 - Eng- Intern Serv Building Shop","11.5 - Eng- Intern Serv Building Shop"]
[null,11.6,"Roads","11.6 - Roads","11.6 - Roads"]
[null,11.7,"Storm Water","11.7 - Storm Water","11.7 - Storm Water"]
[null,11.8,"Eng - Roads/ Storm Water","11.8 - Eng - Roads/ Storm Water","11.8 - Eng - Roads/ Storm Water"]
[null,11.9,"[Name of sub-vote]","11.9 - [Name of sub-vote]"]
[null,"11.10","[Name of sub-vote]","11.10 - [Name of sub-vote]"]
[null,"Vote 12","WATER"]
[null,12.1,"Eng-Admin: Water and Sewerage",{"$f":"CONCATENATE(B124, \" - \", C124)","v":"12.1 - Eng-Admin: Water and Sewerage"},"12.1 - Eng-Admin: Water and Sewerage"]
[null,12.2,"Eng-Admin: Water Supply","12.2 - Eng-Admin: Water Supply","12.2 - Eng-Admin: Water Supply"]
[null,12.3,"Water Workshop","12.3 - Water Workshop","12.3 - Water Workshop"]
[null,12.4,"Sewerage Network","12.4 - Sewerage Network","12.4 - Sewerage Network"]
[null,12.5,"Purifying Works","12.5 - Purifying Works","12.5 - Purifying Works"]
[null,12.6,"[Name of sub-vote]","12.6 - [Name of sub-vote]"]
[null,12.7,"[Name of sub-vote]","12.7 - [Name of sub-vote]"]
[null,12.8,"[Name of sub-vote]","12.8 - [Name of sub-vote]"]
[null,12.9,"[Name of sub-vote]","12.9 - [Name of sub-vote]"]
[null,"12.10","[Name of sub-vote]","12.10 - [Name of sub-vote]"]
[null,"Vote 13","ELECTRICITY"]
[null,13.1,"Elec and Mec Eng Admin",{"$f":"CONCATENATE(B135, \" - \", C135)","v":"13.1 - Elec and Mec Eng Admin"},"13.1 - Elec and Mec Eng Admin"]
[null,13.2,"Distribution","13.2 - Distribution","13.2 - Distribution"]
[null,13.3,"Distribution 132kVA","13.3 - Distribution 132kVA","13.3 - Distribution 132kVA"]
[null,13.4,"Streetlights","13.4 - Streetlights","13.4 - Streetlights"]
[null,13.5,"Electrical Workshop","13.5 - Electrical Workshop","13.5 - Electrical Workshop"]
[null,13.6,"Revenue Protection","13.6 - Revenue Protection","13.6 - Revenue Protection"]
[null,13.7,"Eng - Plant","13.7 - Eng - Plant","13.7 - Eng - Plant"]
[null,13.8,"[Name of sub-vote]","13.8 - [Name of sub-vote]"]
[null,13.9,"[Name of sub-vote]","13.9 - [Name of sub-vote]"]
[null,"13.10","[Name of sub-vote]","13.10 - [Name of sub-vote]"]
[null,"Vote 14","MECHANICAL WORKSHOP"]
[null,14.1,"Mechanical workshop",{"$f":"CONCATENATE(B146, \" - \", C146)","v":"14.1 - Mechanical workshop"},"14.1 - Mechanical workshop"]
[null,14.2,"[Name of sub-vote]","14.2 - [Name of sub-vote]"]
[null,14.3,"[Name of sub-vote]","14.3 - [Name of sub-vote]"]
[null,14.4,"[Name of sub-vote]","14.4 - [Name of sub-vote]"]
[null,14.5,"[Name of sub-vote]","14.5 - [Name of sub-vote]"]
[null,14.6,"[Name of sub-vote]","14.6 - [Name of sub-vote]"]
[null,14.7,"[Name of sub-vote]","14.7 - [Name of sub-vote]"]
[null,14.8,"[Name of sub-vote]","14.8 - [Name of sub-vote]"]
[null,14.9,"[Name of sub-vote]","14.9 - [Name of sub-vote]"]
[null,"14.10","[Name of sub-vote]","14.10 - [Name of sub-vote]"]
[null,"Vote 15","HOUSING SERVICES"]
[null,15.1,"Housing services",{"$f":"CONCATENATE(B157, \" - \", C157)","v":"15.1 - Housing services"},"15.1 - Housing services"]
[null,15.2,"[Name of sub-vote]","15.2 - [Name of sub-vote]"]
[null,15.3,"[Name of sub-vote]","15.3 - [Name of sub-vote]"]
[null,15.4,"[Name of sub-vote]","15.4 - [Name of sub-vote]"]
[null,15.5,"[Name of sub-vote]","15.5 - [Name of sub-vote]"]
[null,15.6,"[Name of sub-vote]","15.6 - [Name of sub-vote]"]
[null,15.7,"[Name of sub-vote]","15.7 - [Name of sub-vote]"]
[null,15.8,"[Name of sub-vote]","15.8 - [Name of sub-vote]"]
[null,15.9,"[Name of sub-vote]","15.9 - [Name of sub-vote]"]
[null,"15.10","[Name of sub-vote]","15.10 - [Name of sub-vote]"]

{"sheet":"Contacts","index":5,"n_rows":84,"n_cols":4,"rows_kept":84,"cut":false,"hidden":false,"merged":[[51,0,51,1],[51,2,51,3],[78,0,78,1],[78,2,78,3],[52,2,52,3],[59,2,59,3],[66,0,66,1],[66,2,66,3],[72,0,72,1],[72,2,72,3],[30,2,30,3],[37,0,37,1],[37,2,37,3],[44,0,44,1],[44,2,44,3],[7,2,7,3],[10,2,10,3],[12,2,12,3],[13,0,13,1],[29,0,29,1],[29,2,29,3]]}
[{"$f":"muni&\" - \"&\" Contact Information\"","v":"FS184 Matjhabeng -  Contact Information"}]
[]
["A. GENERAL INFORMATION"]
["Municipality",{"$f":"muni","v":"FS184 Matjhabeng"},"Set name on 'Instructions' sheet"]
[]
["Grade",5,"1 Grade in terms of the Remuneration of Public Office Bearers Act."]
[]
["Province",{"$f":"IF(B4>\" \",VLOOKUP(B4,'Lookup and lists'!B28:C311,2, FALSE),\" \")","v":"FS FREE STATE"}]
[]
["Web Address","www.matjhabeng.fs.gov.za"]
[]
["e-mail Address","mm@matjhabeng.co.za"]
[]
["B. CONTACT INFORMATION"]
["Postal address:"]
["P.O. Box",708]
["City / Town","Welkom"]
["Postal Code",9459]
[]
["Street address"]
["Building","Civic Building"]
["Street No. & Name","Cnr Ryk & Heeren street"]
["City / Town","Welkom"]
["Postal Code",9459]
[]
["General Contacts"]
["Telephone number","057 3913911"]
["Fax number","057 3521448"]
[]
["C. POLITICAL LEADERSHIP"]
["Speaker:",null,"Secretary/PA to the Speaker:"]
["Name","Cllr. B. Stofile","Name","Me. M. Mohapi"]
["Telephone number","057 3913283","Telephone number","057 3913283"]
["Cell number",null,"Cell number"]
["Fax number","057 3521267","Fax number","057 3521267"]
["E-mail address","bheke.stofile@matjhabeng.co.za","E-mail address","mapitso.mohapi@matjhabeng.co.za"]
[]
["Mayor/Executive Mayor:",null,"Secretary/PA to the Mayor/Executive Mayor:"]
["Name","Cllr. S. Ngangelizwe","Name","Me. B. Mgxabayi"]
["Telephone number","057 391 3149","Telephone number","057 391 3149"]
["Cell number","082 8822402","Cell number","0734649117"]
["Fax number","057 3532161","Fax number","057 3532161"]
["E-mail address","sebenzile.ngangelizwe@matjhabeng.co.za","E-mail address","bulelwa.mgxabayi@matjhabeng.co.za"]
[]
["Deputy Mayor/Executive Mayor:",null,"Secretary/PA to the Deputy Mayor/Executive Mayor:"]
["Name",null,"Name"]
["Telephone number",null,"Telephone number"]
["Cell number",null,"Cell number"]
["Fax number",null,"Fax number"]
["E-mail address",null,"E-mail address"]
[]
["D. MANAGEMENT LEADERSHIP"]
["Municipal Manager:",null,"Secretary/PA to the Municipal Manager:"]
["Name","MF Lepheana","Name","M Lenong"]
["Telephone number","057 391 3970","Telephone number","057 391 3970"]
["Cell number","079 898 0891","Cell number","082 778 7756"]
["Fax number","057 357 4393","Fax number","057 357 4393"]
["E-mail address","mothusi.lepheana@matjhabeng.co.za","E-mail address","tshidi.lenong@matjhabeng.co.za"]
[]
["Chief Financial Officer",null,"Secretary/PA to the Chief Financial Officer"]
["Name","T Tsoaeli","Name","Mantoa Mahloko"]
["Telephone number","057 391 3416","Telephone number","057 3913416"]
["Cell number","0796900476","Cell number","078 2967898"]
["Fax number","057 352 1448","Fax number","057 3521448"]
["E-mail address","thabiso.tsoaeli@matjhabeng.co.za","E-mail address","mantoa.mahloko@matjhabeng.co.za"]
[]
["Official responsible for submitting financial information"]
["Name","LB De Bruyn"]
["Telephone number","0573913416"]
["Cell number","0832352242"]
["Fax number","0573521448"]
["E-mail address","lb@matjhabeng.co.za"]
["Official responsible for submitting financial information"]
["Name","LB Williams"]
["Telephone number","0573913339"]
["Cell number","0762558875"]
["Fax number","0865360665"]
["E-mail address","lindsey.williams@matjhabeng.co.za"]
["Official responsible for submitting financial information"]
["Name","Kgali Tsie"]
["Telephone number","0573913223"]
["Cell number","0766538845"]
["Fax number","0862152418"]
["E-mail address","kgali.tsie@matjhabeng.co.za"]

{"sheet":"C1-Sum","index":6,"n_rows":52,"n_cols":10,"rows_kept":52,"cut":false,"hidden":false,"merged":[[54,0,54,9],[1,0,2,0],[1,2,1,9]]}
[{"$f":"muni& \" - \"&s71sum& \" - \"&date","v":"FS184 Matjhabeng - Table C1 Monthly Budget Statement Summary - M08 February"}]
[{"$f":"desc","v":"Description"},{"$f":"Head1","v":"2014/15"},{"$f":"Head2","v":"Budget Year 2015/16"}]
[null,{"$f":"Head5","v":"Audited Outcome"},{"$f":"Head6","v":"Original Budget"},{"$f":"Head7","v":"Adjusted Budget"},{"$f":"Head38","v":"Monthly actual"},{"$f":"Head39","v":"YearTD actual"},{"$f":"Head40","v":"YearTD budget"},{"$f":"Head41","v":"YTD variance"},{"$f":"Head41","v":"YTD variance"},{"$f":"Head8","v":"Full Year Forecast"}]
["R thousands",null,null,null,null,null,null,null,"%"]
["Financial Performance"]
["Property rates",{"$f":"SUM('C4-FinPerf RE'!C6:C7)","v":0},{"$f":"SUM('C4-FinPerf RE'!D6:D7)","v":189178890},{"$f":"SUM('C4-FinPerf RE'!E6:E7)","v":0},{"$f":"SUM('C4-FinPerf RE'!F6:F7)","v":21196000},{"$f":"SUM('C4-FinPerf RE'!G6:G7)","v":175760000},{"$f":"SUM('C4-FinPerf RE'!H6:H7)","v":126119260},{"$f":"F6-G6","v":49640740},{"$f":"IF(H6=0,\"\",H6/G6)","v":0.39360157996486816},{"$f":"SUM('C4-FinPerf RE'!K6:K7)","v":263640000}]
["Service charges",{"$f":"SUM('C4-FinPerf RE'!C8:C12)","v":0},{"$f":"SUM('C4-FinPerf RE'!D8:D12)","v":1138823505},{"$f":"SUM('C4-FinPerf RE'!E8:E12)","v":0},{"$f":"SUM('C4-FinPerf RE'!F8:F12)","v":89693000},{"$f":"SUM('C4-FinPerf RE'!G8:G12)","v":725920000},{"$f":"SUM('C4-FinPerf RE'!H8:H12)","v":759215670},{"$f":"F7-G7","v":-33295670},{"$f":"IF(H7=0,\"\",H7/G7)","v":-4.3855351404957173E-2},{"$f":"SUM('C4-FinPerf RE'!K8:K12)","v":1088880000}]
["Investment revenue",{"$f":"'C4-FinPerf RE'!C14","v":0},{"$f":"'C4-FinPerf RE'!D14","v":635000},{"$f":"'C4-FinPerf RE'!E14","v":0},{"$f":"'C4-FinPerf RE'!F14","v":264000},{"$f":"'C4-FinPerf RE'!G14","v":1133000},{"$f":"'C4-FinPerf RE'!H14","v":423333.33333333331},{"$f":"F8-G8","v":709666.66666666674},{"$f":"IF(H8=0,\"\",H8/G8)","v":1.6763779527559057},{"$f":"'C4-FinPerf RE'!K14","v":1699500}]
["Transfers recognised - operational",{"$f":"'C4-FinPerf RE'!C20","v":0},{"$f":"'C4-FinPerf RE'!D20","v":406586000},{"$f":"'C4-FinPerf RE'!E20","v":0},{"$f":"'C4-FinPerf RE'!F20","v":0},{"$f":"'C4-FinPerf RE'!G20","v":249393000},{"$f":"'C4-FinPerf RE'!H20","v":271057333.33333331},{"$f":"F9-G9","v":-21664333.333333313},{"$f":"IF(H9=0,\"\",H9/G9)","v":-7.9925280260510628E-2},{"$f":"'C4-FinPerf RE'!K20","v":374089500}]
["Other own revenue",{"$f":"'C4-FinPerf RE'!C13+'C4-FinPerf RE'!C15+'C4-FinPerf RE'!C16+'C4-FinPerf RE'!C17+'C4-FinPerf RE'!C18+'C4-FinPerf RE'!C19+'C4-FinPerf RE'!C21+'C4-FinPerf RE'!C22","v":0},{"$f":"'C4-FinPerf RE'!D13+'C4-FinPerf RE'!D15+'C4-FinPerf RE'!D16+'C4-FinPerf RE'!D17+'C4-FinPerf RE'!D18+'C4-FinPerf RE'!D19+'C4-FinPerf RE'!D21+'C4-FinPerf RE'!D22","v":217496482},{"$f":"'C4-FinPerf RE'!E13+'C4-FinPerf RE'!E15+'C4-FinPerf RE'!E16+'C4-FinPerf RE'!E17+'C4-FinPerf RE'!E18+'C4-FinPerf RE'!E19+'C4-FinPerf RE'!E21+'C4-FinPerf RE'!E22","v":0},{"$f":"'C4-FinPerf RE'!F13+'C4-FinPerf RE'!F15+'C4-FinPerf RE'!F16+'C4-FinPerf RE'!F17+'C4-FinPerf RE'!F18+'C4-FinPerf RE'!F19+'C4-FinPerf RE'!F21+'C4-FinPerf RE'!F22","v":22772000},{"$f":"'C4-FinPerf RE'!G13+'C4-FinPerf RE'!G15+'C4-FinPerf RE'!G16+'C4-FinPerf RE'!G17+'C4-FinPerf RE'!G18+'C4-FinPerf RE'!G19+'C4-FinPerf RE'!G21+'C4-FinPerf RE'!G22","v":189978000},{"$f":"'C4-FinPerf RE'!H13+'C4-FinPerf RE'!H15+'C4-FinPerf RE'!H16+'C4-FinPerf RE'!H17+'C4-FinPerf RE'!H18+'C4-FinPerf RE'!H19+'C4-FinPerf RE'!H21+'C4-FinPerf RE'!H22","v":144997654.66666669},{"$f":"F10-G10","v":44980345.333333313},{"$f":"IF(H10=0,\"\",H10/G10)","v":0.31021429578801168},{"$f":"'C4-FinPerf RE'!K13+'C4-FinPerf RE'!K15+'C4-FinPerf RE'!K16+'C4-FinPerf RE'!K17+'C4-FinPerf RE'!K18+'C4-FinPerf RE'!K19+'C4-FinPerf RE'!K21+'C4-FinPerf RE'!K22","v":284967000}]
["Total Revenue (excluding capital transfers and contributions)",{"$f":"SUM(B6:B10)","v":0},1952719877,0,133925000,1342184000,1301813251.3333335,{"$f":"F11-G11","v":40370748.666666508},{"$f":"IF(H11=0,\"\",H11/G11)","v":3.1011167404632178E-2},2013276000]
["Employee costs",{"$f":"'C4-FinPerf RE'!C26","v":0},{"$f":"'C4-FinPerf RE'!D26","v":569262676},{"$f":"'C4-FinPerf RE'!E26","v":0},{"$f":"'C4-FinPerf RE'!F26","v":51396000},{"$f":"'C4-FinPerf RE'!G26","v":382957000},{"$f":"'C4-FinPerf RE'!H26","v":379508450.66666669},3448549.3333333135,9.0868841715524128E-3,{"$f":"'C4-FinPerf RE'!K26","v":574435500}]
["Remuneration of Councillors",{"$f":"'C4-FinPerf RE'!C27","v":0},{"$f":"'C4-FinPerf RE'!D27","v":26763326},{"$f":"'C4-FinPerf RE'!E27","v":0},{"$f":"'C4-FinPerf RE'!F27","v":2418000},{"$f":"'C4-FinPerf RE'!G27","v":19414000},{"$f":"'C4-FinPerf RE'!H27","v":17842217.333333332},1571782.6666666679,8.8093460431637016E-2,{"$f":"'C4-FinPerf RE'!K27","v":29121000}]
["Depreciation & asset impairment",{"$f":"'C4-FinPerf RE'!C29","v":0},{"$f":"'C4-FinPerf RE'!D29","v":192680410},{"$f":"'C4-FinPerf RE'!E29","v":0},{"$f":"'C4-FinPerf RE'!F29","v":0},{"$f":"'C4-FinPerf RE'!G29","v":0},{"$f":"'C4-FinPerf RE'!H29","v":128453606.66666667},-128453606.66666667,-1,{"$f":"'C4-FinPerf RE'!K29","v":0}]
["Finance charges",{"$f":"'C4-FinPerf RE'!C30","v":0},{"$f":"'C4-FinPerf RE'!D30","v":168000000},{"$f":"'C4-FinPerf RE'!E30","v":0},{"$f":"'C4-FinPerf RE'!F30","v":10157},{"$f":"'C4-FinPerf RE'!G30","v":9138157},{"$f":"'C4-FinPerf RE'!H30","v":112000000},-102861843,-0.91840931250000002,{"$f":"'C4-FinPerf RE'!K30","v":13707235.5}]
["Materials and bulk purchases",{"$f":"SUM('C4-FinPerf RE'!C31:C32)","v":0},{"$f":"SUM('C4-FinPerf RE'!D31:D32)","v":764123980},{"$f":"SUM('C4-FinPerf RE'!E31:E32)","v":0},{"$f":"SUM('C4-FinPerf RE'!F31:F32)","v":29797000},{"$f":"SUM('C4-FinPerf RE'!G31:G32)","v":191809000},{"$f":"SUM('C4-FinPerf RE'!H31:H32)","v":509415986.66666663},-317606986.66666663,-0.62347275111036293,{"$f":"SUM('C4-FinPerf RE'!K31:K32)","v":287713500}]
["Transfers and grants",{"$f":"'C4-FinPerf RE'!C34","v":0},{"$f":"'C4-FinPerf RE'!D34","v":32850000},{"$f":"'C4-FinPerf RE'!E34","v":0},{"$f":"'C4-FinPerf RE'!F34","v":3370000},{"$f":"'C4-FinPerf RE'!G34","v":3370000},{"$f":"'C4-FinPerf RE'!H34","v":21900000},-18530000,-0.84611872146118716,{"$f":"'C4-FinPerf RE'!K34","v":5055000}]
["Other expenditure",{"$f":"'C4-FinPerf RE'!C37-SUM('C1-Sum'!B12:B17)","v":0},{"$f":"'C4-FinPerf RE'!D37-SUM('C1-Sum'!C12:C17)","v":314992129},{"$f":"'C4-FinPerf RE'!E37-SUM('C1-Sum'!D12:D17)","v":0},{"$f":"'C4-FinPerf RE'!F37-SUM('C1-Sum'!E12:E17)","v":15625000},{"$f":"'C4-FinPerf RE'!G37-SUM('C1-Sum'!F12:F17)","v":184730000},{"$f":"'C4-FinPerf RE'!H37-SUM('C1-Sum'!G12:G17)","v":209994752.66666651},-25264752.666666508,-0.12031135228778936,{"$f":"'C4-FinPerf RE'!K37-SUM('C1-Sum'!J12:J17)","v":277095000}]
["Total Expenditure",{"$f":"SUM(B12:B18)","v":0},2068672521,0,102616157,791418157,1379115014,-587696857,-0.4261405691577802,{"$f":"SUM(J12:J18)","v":1187127235.5}]
["Surplus/(Deficit)",{"$f":"B11-B19","v":0},-115952644,0,31308843,550765843,-77301762.666666508,628067605.66666651,-8.1248807789152409,{"$f":"J11-J19","v":826148764.5}]
["Transfers recognised - capital",{"$f":"'C4-FinPerf RE'!C40","v":0},{"$f":"'C4-FinPerf RE'!D40","v":116450997},{"$f":"'C4-FinPerf RE'!E40","v":0},{"$f":"'C4-FinPerf RE'!F40","v":0},{"$f":"'C4-FinPerf RE'!G40","v":80059000},{"$f":"'C4-FinPerf RE'!H40","v":77633998},2425002,3.123634055275628E-2,{"$f":"'C4-FinPerf RE'!K40","v":120088500}]
["Contributions & Contributed assets",{"$f":"SUM('C4-FinPerf RE'!C41:C42)","v":0},{"$f":"SUM('C4-FinPerf RE'!D41:D42)","v":0},{"$f":"SUM('C4-FinPerf RE'!E41:E42)","v":0},{"$f":"SUM('C4-FinPerf RE'!F41:F42)","v":0},{"$f":"SUM('C4-FinPerf RE'!G41:G42)","v":0},{"$f":"SUM('C4-FinPerf RE'!H41:H42)","v":0},0,"",{"$f":"SUM('C4-FinPerf RE'!K41:K42)","v":0}]
["Surplus/(Deficit) after capital transfers & contributions",{"$f":"B20+B21+B22","v":0},498353,0,31308843,630824843,332235.33333349228,630492607.66666651,1897.7289421344856,{"$f":"J20+J21+J22","v":946237264.5}]
["Share of surplus/ (deficit) of associate",{"$f":"'C4-FinPerf RE'!C48","v":0},{"$f":"'C4-FinPerf RE'!D48","v":0},{"$f":"'C4-FinPerf RE'!E48","v":0},{"$f":"'C4-FinPerf RE'!F48","v":0},{"$f":"'C4-FinPerf RE'!G48","v":0},{"$f":"'C4-FinPerf RE'!H48","v":0},0,"",{"$f":"'C4-FinPerf RE'!K48","v":0}]
["Surplus/ (Deficit) for the year",{"$f":"B23+B24","v":0},498353,0,31308843,630824843,332235.33333349228,630492607.66666651,1897.7289421344856,{"$f":"J23+J24","v":946237264.5}]
[]
["Capital expenditure & funds sources"]
["Capital expenditure",{"$f":"'C5-Capex'!C40","v":0},{"$f":"'C5-Capex'!D40","v":146450997},{"$f":"'C5-Capex'!E40","v":0},{"$f":"'C5-Capex'!F40","v":8532000},{"$f":"'C5-Capex'!G40","v":46271000},{"$f":"'C5-Capex'!H40","v":97633998},{"$f":"F28-G28","v":-51362998},{"$f":"IF(H28=0,\"\",H28/G28)","v":-0.52607697167128198},{"$f":"'C5-Capex'!K40","v":69406500}]
["Capital transfers recognised",{"$f":"'C5-Capex'!C70","v":0},{"$f":"'C5-Capex'!D70","v":116451000},{"$f":"'C5-Capex'!E70","v":0},{"$f":"'C5-Capex'!F70","v":7634000},{"$f":"'C5-Capex'!G70","v":45115000},{"$f":"'C5-Capex'!H70","v":77634000},-32519000,-0.41887575031558338,{"$f":"'C5-Capex'!K70","v":67672500}]
["Public contributions & donations",{"$f":"'C5-Capex'!C71","v":0},{"$f":"'C5-Capex'!D71","v":0},{"$f":"'C5-Capex'!E71","v":0},{"$f":"'C5-Capex'!F71","v":0},{"$f":"'C5-Capex'!G71","v":0},{"$f":"'C5-Capex'!H71","v":0},0,"",{"$f":"'C5-Capex'!K71","v":0}]
["Borrowing",{"$f":"'C5-Capex'!C72","v":0},{"$f":"'C5-Capex'!D72","v":0},{"$f":"'C5-Capex'!E72","v":0},{"$f":"'C5-Capex'!F72","v":0},{"$f":"'C5-Capex'!G72","v":0},{"$f":"'C5-Capex'!H72","v":0},0,"",{"$f":"'C5-Capex'!K72","v":0}]
["Internally generated funds",{"$f":"'C5-Capex'!C73","v":0},{"$f":"'C5-Capex'!D73","v":30000000},{"$f":"'C5-Capex'!E73","v":0},{"$f":"'C5-Capex'!F73","v":898000},{"$f":"'C5-Capex'!G73","v":1156000},{"$f":"'C5-Capex'!H73","v":20000000},-18844000,-0.94220000000000004,{"$f":"'C5-Capex'!K73","v":1734000}]
["Total sources of capital funds",{"$f":"SUM(B29:B32)","v":0},146451000,0,{"$f":"SUM(E29:E32)","v":8532000},{"$f":"SUM(F29:F32)","v":46271000},{"$f":"SUM(G29:G32)","v":97634000},-51363000,-0.52607698137943748,69406500]
[]
["Financial position"]
["Total current assets",{"$f":"'C6-FinPos'!C13","v":0},{"$f":"'C6-FinPos'!D13","v":2287118657},{"$f":"'C6-FinPos'!E13","v":0},null,{"$f":"'C6-FinPos'!F13","v":211663000},null,null,null,{"$f":"'C6-FinPos'!G13","v":317494500}]
["Total non current assets",{"$f":"'C6-FinPos'!C25","v":0},{"$f":"'C6-FinPos'!D25","v":5480777435},{"$f":"'C6-FinPos'!E25","v":0},null,{"$f":"'C6-FinPos'!F25","v":26000000},null,null,null,{"$f":"'C6-FinPos'!G25","v":39000000}]
["Total current liabilities",{"$f":"'C6-FinPos'!C35","v":0},{"$f":"'C6-FinPos'!D35","v":1483000000},{"$f":"'C6-FinPos'!E35","v":0},null,{"$f":"'C6-FinPos'!F35","v":-17804000},null,null,null,{"$f":"'C6-FinPos'!G35","v":-26706000}]
["Total non current liabilities",{"$f":"'C6-FinPos'!C40","v":0},{"$f":"'C6-FinPos'!D40","v":318000000},{"$f":"'C6-FinPos'!E40","v":0},null,{"$f":"'C6-FinPos'!F40","v":0},null,null,null,{"$f":"'C6-FinPos'!G40","v":0}]
["Community wealth/Equity",{"$f":"'C6-FinPos'!C48","v":0},{"$f":"'C6-FinPos'!D48","v":5966896092},{"$f":"'C6-FinPos'!E48","v":0},null,{"$f":"'C6-FinPos'!F48","v":255467000},null,null,null,{"$f":"'C6-FinPos'!G48","v":383200500}]
[]
["Cash flows"]
["Net cash from (used) operating",{"$f":"'C7-CFlow'!C18","v":0},{"$f":"'C7-CFlow'!D18","v":3907924480},{"$f":"'C7-CFlow'!E18","v":0},{"$f":"'C7-CFlow'!F18","v":183063157},{"$f":"'C7-CFlow'!G18","v":1745461157},{"$f":"'C7-CFlow'!H18","v":2605282986.666667},{"$f":"G43-F43","v":859821829.66666698},{"$f":"IF(H43=0,\"\",H43/G43)","v":0.33003010961460555},{"$f":"'C7-CFlow'!K18","v":2618191735.5}]
["Net cash from (used) investing",{"$f":"'C7-CFlow'!C28","v":0},{"$f":"'C7-CFlow'!D28","v":146450997},{"$f":"'C7-CFlow'!E28","v":0},{"$f":"'C7-CFlow'!F28","v":8532000},{"$f":"'C7-CFlow'!G28","v":46271000},{"$f":"'C7-CFlow'!H28","v":97633998},{"$f":"G44-F44","v":51362998},{"$f":"IF(H44=0,\"\",H44/G44)","v":0.52607697167128198},{"$f":"'C7-CFlow'!K28","v":69406500}]
["Net cash from (used) financing",{"$f":"'C7-CFlow'!C37","v":0},{"$f":"'C7-CFlow'!D37","v":0},{"$f":"'C7-CFlow'!E37","v":0},{"$f":"'C7-CFlow'!F37","v":0},{"$f":"'C7-CFlow'!G37","v":0},{"$f":"'C7-CFlow'!H37","v":0},{"$f":"G45-F45","v":0},{"$f":"IF(H45=0,\"\",H45/G45)","v":""},{"$f":"'C7-CFlow'!K37","v":0}]
["Cash/cash equivalents at the month/year end",{"$f":"'C7-CFlow'!C41","v":0},{"$f":"'C7-CFlow'!D41","v":4054375477},{"$f":"'C7-CFlow'!E41","v":0},{"$f":"'C7-CFlow'!F41","v":0},{"$f":"'C7-CFlow'!G41","v":1791732157},{"$f":"'C7-CFlow'!H41","v":2702916984.666667},{"$f":"G46-F46","v":911184827.66666698},{"$f":"IF(H46=0,\"\",H46/G46)","v":0.33711165856580588},{"$f":"'C7-CFlow'!K41","v":2687598235.5}]
[]
["Debtors & creditors analysis",{"$f":"'SC3'!C3","v":"0-30 Days"},{"$f":"'SC3'!D3","v":"31-60 Days"},{"$f":"'SC3'!E3","v":"61-90 Days"},{"$f":"'SC3'!F3","v":"91-120 Days"},{"$f":"'SC3'!G3","v":"121-150 Dys"},{"$f":"'SC3'!H3","v":"151-180 Dys"},{"$f":"'SC3'!I3","v":"181 Dys-1 Yr"},{"$f":"'SC3'!J3","v":"Over 1Yr"},"Total"]
[{"$f":"LEFT('SC3'!A4,20)","v":"Debtors Age Analysis"}]
[{"$f":"'SC3'!A14","v":"Total By Income Source"},{"$f":"'SC3'!C14","v":126984857.44000001},{"$f":"'SC3'!D14","v":84626801.550000504},{"$f":"'SC3'!E14","v":76837752.229993939},{"$f":"'SC3'!F14","v":73406595.400000677},{"$f":"'SC3'!G14","v":78562763.469998613},{"$f":"'SC3'!H14","v":53551358.099994987},{"$f":"'SC3'!I14","v":311779380.33999258},{"$f":"'SC3'!J14","v":1258180433.540154},{"$f":"'SC3'!K14","v":2063929942.0701356}]
[{"$f":"LEFT('SC4'!A5,22)","v":"Creditors Age Analysis"}]
["Total Creditors",{"$f":"'SC4'!C15","v":89006945},{"$f":"'SC4'!D15","v":81001620},{"$f":"'SC4'!E15","v":88221000},{"$f":"'SC4'!F15","v":56595000},{"$f":"'SC4'!G15","v":2028047000},{"$f":"'SC4'!H15","v":30402},{"$f":"'SC4'!I15","v":38494000},{"$f":"'SC4'!J15","v":0},{"$f":"'SC4'!K15","v":2381395967}]

{"sheet":"C2-FinPerf SC","index":7,"n_rows":55,"n_cols":11,"rows_kept":55,"cut":false,"hidden":false,"merged":[[1,1,2,1],[1,0,2,0],[0,0,0,10],[54,0,54,10]]}
[{"$f":"muni& \" - \"&S71A& \" - \"&date","v":"FS184 Matjhabeng - Table C2 Monthly Budget Statement - Financial Performance (standard classification) - M08 February"}]
[{"$f":"desc","v":"Description"},{"$f":"head27","v":"Ref"},{"$f":"Head1","v":"2014/15"},{"$f":"Head2","v":"Budget Year 2015/16"}]
[null,null,{"$f":"Head5","v":"Audited Outcome"},{"$f":"Head6","v":"Original Budget"},{"$f":"Head7","v":"Adjusted Budget"},{"$f":"Head38","v":"Monthly actual"},{"$f":"Head39","v":"YearTD actual"},{"$f":"Head40","v":"YearTD budget"},{"$f":"Head41","v":"YTD variance"},{"$f":"Head41","v":"YTD variance"},{"$f":"Head8","v":"Full Year Forecast"}]
["R thousands",1,null,null,null,null,null,null,null,"%"]
["Revenue - Standard"]
["Governance and administration",null,{"$f":"SUM(C7:C9)","v":0},792404519,0,40939000,674467000,528269679.33333331,{"$f":"G6-H6","v":146197320.66666669},{"$f":"IF(I6=0,\"\",I6/H6)","v":0.27674751435888773},{"$f":"SUM(K7:K9)","v":1011700500}]
["Executive and council",null,{"$f":"'C2C'!C7","v":0},{"$f":"'C2C'!D7","v":524153000},{"$f":"'C2C'!E7","v":0},{"$f":"'C2C'!F7","v":10968000},{"$f":"'C2C'!G7","v":405719000},{"$f":"'C2C'!H7","v":349435333.33333331},56283666.666666687,{"$f":"IF(I7=0,\"\",I7/H7)","v":0.16107033633309364},{"$f":"'C2C'!K7","v":608578500}]
["Budget and treasury office",null,{"$f":"'C2C'!C10","v":0},{"$f":"'C2C'!D10","v":268251519},{"$f":"'C2C'!E10","v":0},{"$f":"'C2C'!F10","v":29971000},{"$f":"'C2C'!G10","v":268748000},{"$f":"'C2C'!H10","v":178834346},89913654,0.50277620608739215,{"$f":"'C2C'!K10","v":403122000}]
["Corporate services",null,{"$f":"'C2C'!C11","v":0},{"$f":"'C2C'!D11","v":0},{"$f":"'C2C'!E11","v":0},{"$f":"'C2C'!F11","v":0},{"$f":"'C2C'!G11","v":0},{"$f":"'C2C'!H11","v":0},0,"",{"$f":"'C2C'!K11","v":0}]
["Community and public safety",null,{"$f":"SUM(C11:C15)","v":0},15503617,0,1400000,13791000,10335744.666666666,3455255.333333334,0.33430153750573183,{"$f":"SUM(K11:K15)","v":20686500}]
["Community and social services",null,{"$f":"'C2C'!C17","v":0},{"$f":"'C2C'!D17","v":0},{"$f":"'C2C'!E17","v":0},{"$f":"'C2C'!F17","v":0},{"$f":"'C2C'!G17","v":0},{"$f":"'C2C'!H17","v":0},0,"",{"$f":"'C2C'!K17","v":0}]
["Sport and recreation",null,{"$f":"'C2C'!C26","v":0},{"$f":"'C2C'!D26","v":0},{"$f":"'C2C'!E26","v":0},{"$f":"'C2C'!F26","v":0},{"$f":"'C2C'!G26","v":0},{"$f":"'C2C'!H26","v":0},0,"",{"$f":"'C2C'!K26","v":0}]
["Public safety",null,{"$f":"'C2C'!C27","v":0},{"$f":"'C2C'!D27","v":4744531},{"$f":"'C2C'!E27","v":0},{"$f":"'C2C'!F27","v":219000},{"$f":"'C2C'!G27","v":1747000},{"$f":"'C2C'!H27","v":3163020.6666666665},-1416020.6666666665,-0.44767986551252376,{"$f":"'C2C'!K27","v":2620500}]
["Housing",null,{"$f":"'C2C'!C33","v":0},{"$f":"'C2C'!D33","v":10759086},{"$f":"'C2C'!E33","v":0},{"$f":"'C2C'!F33","v":1181000},{"$f":"'C2C'!G33","v":12044000},{"$f":"'C2C'!H33","v":7172724},{"$f":"G14-H14","v":4871276},{"$f":"IF(I14=0,\"\",I14/H14)","v":0.67913891570343432},{"$f":"'C2C'!K33","v":18066000}]
["Health",null,{"$f":"'C2C'!C34","v":0},{"$f":"'C2C'!D34","v":0},{"$f":"'C2C'!E34","v":0},{"$f":"'C2C'!F34","v":0},{"$f":"'C2C'!G34","v":0},{"$f":"'C2C'!H34","v":0},0,"",{"$f":"'C2C'!K34","v":0}]
["Economic and environmental services",null,{"$f":"SUM(C17:C19)","v":0},31751136,0,0,0,21167424,-21167424,-1,{"$f":"SUM(K17:K19)","v":0}]
["Planning and development",null,{"$f":"'C2C'!C39","v":0},{"$f":"'C2C'!D39","v":14643021},{"$f":"'C2C'!E39","v":0},{"$f":"'C2C'!F39","v":0},{"$f":"'C2C'!G39","v":0},{"$f":"'C2C'!H39","v":9762014},-9762014,-1,{"$f":"'C2C'!K39","v":0}]
["Road transport",null,{"$f":"'C2C'!C43","v":0},{"$f":"'C2C'!D43","v":17108115},{"$f":"'C2C'!E43","v":0},{"$f":"'C2C'!F43","v":0},{"$f":"'C2C'!G43","v":0},{"$f":"'C2C'!H43","v":11405410},-11405410,-1,{"$f":"'C2C'!K43","v":0}]
["Environmental protection",null,{"$f":"'C2C'!C49","v":0},{"$f":"'C2C'!D49","v":0},{"$f":"'C2C'!E49","v":0},{"$f":"'C2C'!F49","v":0},{"$f":"'C2C'!G49","v":0},{"$f":"'C2C'!H49","v":0},0,"",{"$f":"'C2C'!K49","v":0}]
["Trading services",null,{"$f":"SUM(C21:C24)","v":0},{"$f":"SUM(D21:D24)","v":1218976839},0,89693000,725919000,812651226,-86732225.999999985,-0.10672749049664264,{"$f":"SUM(K21:K24)","v":1003618500}]
["Electricity",null,{"$f":"'C2C'!C54","v":0},{"$f":"'C2C'!D54","v":748264548},{"$f":"'C2C'!E54","v":0},{"$f":"'C2C'!F54","v":40039000},{"$f":"'C2C'!G54","v":341397000},{"$f":"'C2C'!H54","v":498843032},{"$f":"G21-H21","v":-157446032},-0.31562239401992892,{"$f":"'C2C'!K54","v":512095500}]
["Water",null,{"$f":"'C2C'!C57","v":0},{"$f":"'C2C'!D57","v":203889265},{"$f":"'C2C'!E57","v":0},{"$f":"'C2C'!F57","v":30062000},{"$f":"'C2C'!G57","v":235067000},{"$f":"'C2C'!H57","v":135926176.66666666},{"$f":"G22-H22","v":99140823.333333343},0.72937255916833099,{"$f":"'C2C'!K57","v":352600500}]
["Waste water management",null,{"$f":"'C2C'!C60","v":0},{"$f":"'C2C'!D60","v":151663419},{"$f":"'C2C'!E60","v":0},{"$f":"'C2C'!F60","v":12108000},{"$f":"'C2C'!G60","v":92615000},{"$f":"'C2C'!H60","v":101108946},{"$f":"G23-H23","v":-8493946},-8.4007858216621115E-2,{"$f":"'C2C'!K60","v":138922500}]
["Waste management",null,{"$f":"'C2C'!C64","v":0},{"$f":"'C2C'!D64","v":115159607},{"$f":"'C2C'!E64","v":0},{"$f":"'C2C'!F64","v":7484000},{"$f":"'C2C'!G64","v":56840000},{"$f":"'C2C'!H64","v":76773071.333333328},{"$f":"G24-H24","v":-19933071.333333328},-0.25963623686211429,{"$f":"'C2C'!K64","v":0}]
["Other",4,{"$f":"'C2C'!C66","v":0},{"$f":"'C2C'!D66","v":10535024},{"$f":"'C2C'!E66","v":0},{"$f":"'C2C'!F66","v":1893000},{"$f":"'C2C'!G66","v":8065000},{"$f":"'C2C'!H66","v":7023349.333333333},{"$f":"G25-H25","v":1041650.666666667},0.14831252401513281,{"$f":"'C2C'!K66","v":12097500}]
["Total Revenue - Standard",2,{"$f":"C6+C10+C16+C20+C25","v":0},{"$f":"D6+D10+D16+D20+D25","v":2069171135},0,133925000,1422242000,1379447423.3333333,42794576.666666709,3.1022984959627357E-2,{"$f":"K6+K10+K16+K20+K25","v":2048103000}]
[]
["Expenditure - Standard"]
[{"$f":"A6","v":"Governance and administration"},null,{"$f":"SUM(C30:C32)","v":0},276334673,0,26926073,213982073,184223115.33333334,{"$f":"G29-H29","v":29758957.666666657},{"$f":"IF(I29=0,\"\",I29/H29)","v":0.16153758779304536},{"$f":"SUM(K30:K32)","v":320973109.5}]
[{"$f":"A7","v":"Executive and council"},null,{"$f":"'C2C'!C76","v":0},{"$f":"'C2C'!D76","v":142974437},{"$f":"'C2C'!E76","v":0},{"$f":"'C2C'!F76","v":16420073},{"$f":"'C2C'!G76","v":113159073},{"$f":"'C2C'!H76","v":95316291.333333328},17842781.666666672,{"$f":"IF(I30=0,\"\",I30/H30)","v":0.18719550894262313},{"$f":"'C2C'!K76","v":169738609.5}]
["Budget and treasury office",null,{"$f":"'C2C'!C79","v":0},{"$f":"'C2C'!D79","v":63922738},{"$f":"'C2C'!E79","v":0},{"$f":"'C2C'!F79","v":4683000},{"$f":"'C2C'!G79","v":61094000},{"$f":"'C2C'!H79","v":42615158.666666664},18478841.333333336,0.43362131953734528,{"$f":"'C2C'!K79","v":91641000}]
["Corporate services",null,{"$f":"'C2C'!C80","v":0},{"$f":"'C2C'!D80","v":69437498},{"$f":"'C2C'!E80","v":0},{"$f":"'C2C'!F80","v":5823000},{"$f":"'C2C'!G80","v":39729000},{"$f":"'C2C'!H80","v":46291665.333333336},-6562665.3333333358,-0.14176775205811712,{"$f":"'C2C'!K80","v":59593500}]
["Community and public safety",null,{"$f":"SUM(C34:C38)","v":0},359204295,0,23136000,201676000,239469530,-37793530,-0.15782187403967426,{"$f":"SUM(K34:K38)","v":302514000}]
["Community and social services",null,{"$f":"'C2C'!C86","v":0},{"$f":"'C2C'!D86","v":42187866},{"$f":"'C2C'!E86","v":0},{"$f":"'C2C'!F86","v":2948000},{"$f":"'C2C'!G86","v":23234000},{"$f":"'C2C'!H86","v":28125243.999999996},-4891243.9999999963,-0.17390938901721162,{"$f":"'C2C'!K86","v":34851000}]
["Sport and recreation",null,{"$f":"'C2C'!C95","v":0},{"$f":"'C2C'!D95","v":131385165},{"$f":"'C2C'!E95","v":0},{"$f":"'C2C'!F95","v":7029000},{"$f":"'C2C'!G95","v":57504000},{"$f":"'C2C'!H95","v":87590110},-30086110,-0.34348752387683951,{"$f":"'C2C'!K95","v":86256000}]
["Public safety",null,{"$f":"'C2C'!C96","v":0},{"$f":"'C2C'!D96","v":162614466},{"$f":"'C2C'!E96","v":0},{"$f":"'C2C'!F96","v":11321000},{"$f":"'C2C'!G96","v":104168000},{"$f":"'C2C'!H96","v":108409644.00000001},-4241644.0000000149,-3.9126076274173673E-2,{"$f":"'C2C'!K96","v":156252000}]
["Housing",null,{"$f":"'C2C'!C102","v":0},{"$f":"'C2C'!D102","v":23016798},{"$f":"'C2C'!E102","v":0},{"$f":"'C2C'!F102","v":1838000},{"$f":"'C2C'!G102","v":16770000},{"$f":"'C2C'!H102","v":15344532},1425468,9.289745689213591E-2,{"$f":"'C2C'!K102","v":25155000}]
["Health",null,{"$f":"'C2C'!C103","v":0},{"$f":"'C2C'!D103","v":0},{"$f":"'C2C'!E103","v":0},{"$f":"'C2C'!F103","v":0},{"$f":"'C2C'!G103","v":0},{"$f":"'C2C'!H103","v":0},0,"",{"$f":"'C2C'!K103","v":0}]
["Economic and environmental services",null,{"$f":"SUM(C40:C42)","v":0},159103672,0,5223000,41759000,106069114.66666667,-64310114.666666672,-0.60630386959265148,{"$f":"SUM(K40:K42)","v":62638500}]
["Planning and development",null,{"$f":"'C2C'!C108","v":0},{"$f":"'C2C'!D108","v":34187490},{"$f":"'C2C'!E108","v":0},{"$f":"'C2C'!F108","v":1118000},{"$f":"'C2C'!G108","v":9567000},{"$f":"'C2C'!H108","v":22791660},-13224660,-0.58024119348919734,{"$f":"'C2C'!K108","v":14350500}]
["Road transport",null,{"$f":"'C2C'!C112","v":0},{"$f":"'C2C'!D112","v":124916182},{"$f":"'C2C'!E112","v":0},{"$f":"'C2C'!F112","v":3345000},{"$f":"'C2C'!G112","v":28408000},{"$f":"'C2C'!H112","v":83277454.666666672},-54869454.666666672,-0.65887526085291337,{"$f":"'C2C'!K112","v":42612000}]
["Environmental protection",null,{"$f":"'C2C'!C118","v":0},{"$f":"'C2C'!D118","v":0},{"$f":"'C2C'!E118","v":0},{"$f":"'C2C'!F118","v":760000},{"$f":"'C2C'!G118","v":3784000},{"$f":"'C2C'!H118","v":0},3784000,{"$error":"#DIV/0!"},{"$f":"'C2C'!K118","v":5676000}]
["Trading services",null,{"$f":"SUM(C44:C47)","v":0},{"$f":"SUM(D44:D47)","v":1268684438},0,46874000,329739000,845789625.33333337,-516050625.33333337,-0.61014064239668719,{"$f":"SUM(K44:K47)","v":494608500}]
["Electricity",null,{"$f":"'C2C'!C123","v":0},{"$f":"'C2C'!D123","v":572453401},{"$f":"'C2C'!E123","v":0},{"$f":"'C2C'!F123","v":21373000},{"$f":"'C2C'!G123","v":148376000},{"$f":"'C2C'!H123","v":381635600.66666669},-233259600.66666669,-0.61121027561158647,{"$f":"'C2C'!K123","v":222564000}]
["Water",null,{"$f":"'C2C'!C126","v":0},{"$f":"'C2C'!D126","v":474514794},{"$f":"'C2C'!E126","v":0},{"$f":"'C2C'!F126","v":14782000},{"$f":"'C2C'!G126","v":95098000},{"$f":"'C2C'!H126","v":316343196},-221245196,-0.69938345062430229,{"$f":"'C2C'!K126","v":142647000}]
["Waste water management",null,{"$f":"'C2C'!C129","v":0},{"$f":"'C2C'!D129","v":120576463},{"$f":"'C2C'!E129","v":0},{"$f":"'C2C'!F129","v":4275000},{"$f":"'C2C'!G129","v":39754000},{"$f":"'C2C'!H129","v":80384308.666666672},-40630308.666666672,-0.5054507445619798,{"$f":"'C2C'!K129","v":59631000}]
["Waste management",null,{"$f":"'C2C'!C133","v":0},{"$f":"'C2C'!D133","v":101139780},{"$f":"'C2C'!E133","v":0},{"$f":"'C2C'!F133","v":6444000},{"$f":"'C2C'!G133","v":46511000},{"$f":"'C2C'!H133","v":67426520},-20915520,-0.31019723396669441,{"$f":"'C2C'!K133","v":69766500}]
["Other",null,{"$f":"'C2C'!C135","v":0},{"$f":"'C2C'!D135","v":5345438},{"$f":"'C2C'!E135","v":0},{"$f":"'C2C'!F135","v":459000},{"$f":"'C2C'!G135","v":4261000},{"$f":"'C2C'!H135","v":3563625.3333333335},697374.66666666651,0.19569247646310736,{"$f":"'C2C'!K135","v":6391500}]
["Total Expenditure - Standard",3,{"$f":"C29+C33+C39+C43+C48","v":0},{"$f":"D29+D33+D39+D43+D48","v":2068672516},0,102618073,791417073,1379115010.6666667,-587697937.66666675,-0.42614135378206963,{"$f":"K29+K33+K39+K43+K48","v":1187125609.5}]
["Surplus/ (Deficit) for the year",null,{"$f":"C26-C49","v":0},498619,0,31306927,630824927,332412.66666650772,{"$f":"I26-I49","v":630492514.33333349},{"$f":"IF(I50=0,\"\",I50/H50)","v":1896.7162733478917},{"$f":"K26-K49","v":860977390.5}]
[{"$f":"head27a","v":"References"}]
["1. Government Finance Statistics Functions and Sub-functions are standardised to assist the compilation of national and international accounts for comparison purposes"]
["2. Total Revenue by standard classification must reconcile to Total Operating Revenue shown in the Financial Performance Statement"]
["3. Total Expenditure by standard classification must reconcile to total operating expenditure shown in 'Financial Performance Statement'"]
["4. All amounts must be classified under a standard classification (modified GFS). The GFS function 'Other' is only for Abbatoirs, Air Transport, Markets and Tourism - and if used must be supported by footnotes. Nothing else may be placed under 'Other'. Assign associate share to relevant classification"]

{"sheet":"C2C","index":8,"n_rows":151,"n_cols":11,"rows_kept":151,"cut":false,"hidden":false,"merged":[[146,0,146,10],[0,0,0,10],[1,0,2,0],[1,1,2,1]]}
[{"$f":"muni& \" - \"&S71A& \" - \"&date","v":"FS184 Matjhabeng - Table C2 Monthly Budget Statement - Financial Performance (standard classification) - M08 February"}]
[{"$f":"desc","v":"Description"},{"$f":"head27","v":"Ref"},{"$f":"Head1","v":"2014/15"},{"$f":"Head2","v":"Budget Year 2015/16"}]
[null,null,{"$f":"Head5","v":"Audited Outcome"},{"$f":"Head6","v":"Original Budget"},{"$f":"Head7","v":"Adjusted Budget"},{"$f":"Head38","v":"Monthly actual"},{"$f":"Head39","v":"YearTD actual"},{"$f":"Head40","v":"YearTD budget"},{"$f":"Head41","v":"YTD variance"},{"$f":"Head41","v":"YTD variance"},{"$f":"Head8","v":"Full Year Forecast"}]
["R thousands",1,null,null,null,null,null,null,null,"%"]
["Revenue - Standard"]
["Municipal governance and administration",null,{"$f":"C7+C10+C11","v":0},{"$f":"D7+D10+D11","v":792404519},0,40939000,674467000,528269679.33333331,{"$f":"G6-H6","v":146197320.66666669},{"$f":"IF(I6=0,\"\",I6/H6)","v":0.27674751435888773},1011700500]
["Executive and council",null,{"$f":"SUM(C8:C9)","v":0},{"$f":"SUM(D8:D9)","v":524153000},0,10968000,405719000,349435333.33333331,{"$f":"G7-H7","v":56283666.666666687},{"$f":"IF(I7=0,\"\",I7/H7)","v":0.16107033633309364},608578500]
["Mayor and Council",null,null,{"$f":"'C3C'!D6+'C3C'!D17+'C3C'!D28","v":406586000},null,{"$f":"'C3C'!F6+'C3C'!F17+'C3C'!F28","v":0},{"$f":"'C3C'!G6+'C3C'!G17+'C3C'!G28","v":329452000},{"$f":"D8/12*8","v":271057333.33333331},58394666.666666687,0.21543289734521118,{"$f":"G8*12/8","v":494178000}]
["Municipal Manager",null,null,{"$f":"'C3C'!D39-'C3C'!D44","v":117567000},null,{"$f":"'C3C'!F39-'C3C'!F44","v":10968000},{"$f":"'C3C'!G39-'C3C'!G44","v":76267000},{"$f":"D9/12*8","v":78378000},-2111000,-2.6933578300033172E-2,{"$f":"G9*12/8","v":114400500}]
["Budget and treasury office",null,null,{"$f":"'C3C'!D61-'C3C'!D67","v":268251519},null,{"$f":"'C3C'!F61-'C3C'!F67","v":29971000},{"$f":"'C3C'!G61-'C3C'!G67","v":268748000},{"$f":"D10/12*8","v":178834346},89913654,0.50277620608739215,{"$f":"G10*12/8","v":403122000}]
["Corporate services",null,{"$f":"SUM(C12:C15)","v":0},{"$f":"SUM(D12:D15)","v":0},0,0,0,0,0,"",0]
["Human Resources",null,null,{"$f":"'C3C'!D72","v":0},null,{"$f":"'C3C'!F72","v":0},{"$f":"'C3C'!G72","v":0},null,0,""]
["Information Technology",null,null,{"$f":"'C3C'!D44","v":0},null,{"$f":"'C3C'!F44","v":0},{"$f":"'C3C'!G44","v":0},null,0,""]
["Property Services",null,null,null,null,null,null,null,0,""]
["Other Admin",null,null,{"$f":"'C3C'!D51","v":0},null,{"$f":"'C3C'!F51","v":0},{"$f":"'C3C'!G51","v":0},null,0,""]
["Community and public safety",null,{"$f":"C17+C26+C27+C33+C34","v":0},{"$f":"D17+D26+D27+D33+D34","v":15503617},0,1400000,13791000,10335744.666666666,3455255.333333334,0.33430153750573183,20686500]
["Community and social services",null,{"$f":"SUM(C18:C25)","v":0},{"$f":"SUM(D18:D25)","v":0},0,0,0,0,0,"",0]
["Libraries and Archives",null,null,{"$f":"'C3C'!D52","v":0},null,{"$f":"'C3C'!F52","v":0},{"$f":"'C3C'!G52","v":0},null,0,""]
["Museums & Art Galleries etc",null,null,null,null,null,null,null,0,""]
["Community halls and Facilities",null,null,{"$f":"'C3C'!D53","v":0},null,{"$f":"'C3C'!F53","v":0},{"$f":"'C3C'!G53","v":0},null,0,""]
["Cemeteries & Crematoriums",null,null,null,null,null,null,null,0,""]
["Child Care",null,null,null,null,null,null,null,0,""]
["Aged Care",null,null,null,null,null,null,null,0,""]
["Other Community",null,null,{"$f":"'C3C'!D84","v":0},null,{"$f":"'C3C'!F84","v":0},{"$f":"'C3C'!G84","v":0},null,0,""]
["Other Social",null,null,null,null,null,null,null,0,""]
["Sport and recreation",null,null,{"$f":"'C3C'!D85","v":0},null,{"$f":"'C3C'!F85","v":0},{"$f":"'C3C'!G85","v":0},null,0,""]
["Public safety",null,{"$f":"SUM(C28:C32)","v":0},{"$f":"SUM(D28:D32)","v":4744531},0,219000,1747000,3163020.6666666665,-1416020.6666666665,-0.44767986551252376,2620500]
["Police",null,null,{"$f":"'C3C'!D95+'C3C'!D96","v":4744531},null,{"$f":"'C3C'!F95+'C3C'!F96","v":219000},{"$f":"'C3C'!G95+'C3C'!G96","v":1747000},{"$f":"D28/12*8","v":3163020.6666666665},-1416020.6666666665,-0.44767986551252376,{"$f":"G28*12/8","v":2620500}]
["Fire",null,null,{"$f":"'C3C'!D98","v":0},null,{"$f":"'C3C'!F98","v":0},{"$f":"'C3C'!G98","v":0},null,0,"",0]
["Civil Defence",null,null,{"$f":"'C3C'!D97","v":0},null,{"$f":"'C3C'!F97","v":0},{"$f":"'C3C'!G97","v":0},null,0,"",0]
["Street Lighting",null,null,{"$f":"'C3C'!D142","v":0},null,{"$f":"'C3C'!F142","v":0},{"$f":"'C3C'!G142","v":0},null,0,"",0]
["Other",null,null,{"$f":"'C3C'!D150","v":0},null,{"$f":"'C3C'!F150","v":0},{"$f":"'C3C'!G150","v":0},null,0,"",0]
["Housing",null,null,{"$f":"'C3C'!D161","v":10759086},null,{"$f":"'C3C'!F161","v":1181000},{"$f":"'C3C'!G161","v":12044000},{"$f":"D33/12*8","v":7172724},4871276,0.67913891570343432,18066000]
["Health",null,{"$f":"SUM(C35:C37)","v":0},{"$f":"SUM(D35:D37)","v":0},0,0,0,0,0,"",0]
["Clinics",null,null,null,null,null,null,null,0,""]
["Ambulance",null,null,null,null,null,null,null,0,""]
["Other   ",null,null,null,null,null,null,null,0,""]
["Economic and environmental services",null,{"$f":"C39+C43+C49","v":0},{"$f":"D39+D43+D49","v":31751136},0,0,0,21167424,-21167424,-1,0]
["Planning and development",null,{"$f":"SUM(C40:C42)","v":0},{"$f":"SUM(D40:D42)","v":14643021},0,0,0,9762014,-9762014,-1,0]
["Economic Development/Planning ",null,null,{"$f":"'C3C'!D106","v":14643021},null,{"$f":"'C3C'!F106","v":0},{"$f":"'C3C'!G106","v":0},{"$f":"D40/12*8","v":9762014},-9762014,-1,{"$f":"G40*12/8","v":0}]
["Town Planning/Building enforcement ",null,null,null,null,null,null,null,0,""]
["Licensing & Regulation",null,null,null,null,null,null,null,0,""]
["Road transport",null,{"$f":"SUM(C44:C48)","v":0},{"$f":"SUM(D44:D48)","v":17108115},0,0,0,11405410,-11405410,-1,0]
["Roads",null,null,{"$f":"'C3C'!D122","v":17108115},null,{"$f":"'C3C'!F122","v":0},{"$f":"'C3C'!G122","v":0},{"$f":"D44/12*8","v":11405410},-11405410,-1,{"$f":"G44*12/8","v":0}]
["Public Buses",null,null,null,null,null,null,null,0,""]
["Parking Garages",null,null,null,null,null,null,null,0,""]
["Vehicle Licensing and Testing",null,null,null,null,null,null,null,0,""]
["Other",null,null,{"$f":"'C3C'!D117+'C3C'!D118+'C3C'!D119+'C3C'!D120+'C3C'!D121","v":0},null,{"$f":"'C3C'!F117+'C3C'!F118+'C3C'!F119+'C3C'!F120+'C3C'!F121","v":0},{"$f":"'C3C'!G117+'C3C'!G118+'C3C'!G119+'C3C'!G120+'C3C'!G121","v":0},null,0,""]
["Environmental protection",null,{"$f":"SUM(C50:C52)","v":0},{"$f":"SUM(D50:D52)","v":0},0,0,0,0,0,"",0]
["Pollution Control",null,null,null,null,null,null,null,0,""]
["Biodiversity & Landscape",null,null,null,null,null,null,null,0,""]
["Other",null,null,{"$f":"'C3C'!D87","v":0},null,{"$f":"'C3C'!F87","v":0},{"$f":"'C3C'!G87","v":0},null,0,""]
["Trading services",null,{"$f":"C54+C57+C60+C64","v":0},{"$f":"D54+D57+D60+D64","v":1218976839},0,89693000,725919000,812651226,-86732225.999999985,-0.10672749049664264,{"$f":"K54+K57+K60+K64","v":1003618500}]
["Electricity",null,{"$f":"SUM(C55:C56)","v":0},{"$f":"SUM(D55:D56)","v":748264548},0,40039000,341397000,498843032,-157446032,-0.31562239401992892,512095500]
["Electricity Distribution",null,null,{"$f":"'C3C'!D138-'C3C'!D142","v":748264548},null,{"$f":"'C3C'!F138-'C3C'!F142","v":40039000},{"$f":"'C3C'!G138-'C3C'!G142","v":341397000},{"$f":"D55/12*8","v":498843032},-157446032,-0.31562239401992892,{"$f":"G55*12/8","v":512095500}]
["Electricity Generation",null,null,null,null,null,null,null,0,""]
["Water",null,{"$f":"SUM(C58:C59)","v":0},{"$f":"SUM(D58:D59)","v":203889265},0,30062000,235067000,135926176.66666666,99140823.333333343,0.72937255916833099,352600500]
["Water Distribution",null,null,{"$f":"'C3C'!D128+'C3C'!D129+'C3C'!D130","v":203889265},null,{"$f":"'C3C'!F128+'C3C'!F129+'C3C'!F130","v":30062000},{"$f":"'C3C'!G128+'C3C'!G129+'C3C'!G130","v":235067000},{"$f":"D58/12*8","v":135926176.66666666},99140823.333333343,0.72937255916833099,{"$f":"G58*12/8","v":352600500}]
["Water Storage",null,null,null,null,null,null,{"$f":"D59/12*8","v":0},0,"",{"$f":"G59*12/8","v":0}]
["Waste water management",null,{"$f":"SUM(C61:C63)","v":0},{"$f":"SUM(D61:D63)","v":151663419},0,12108000,92615000,101108946,-8493946,-8.4007858216621115E-2,138922500]
["Sewerage",null,null,{"$f":"'C3C'!D131+'C3C'!D132","v":151663419},null,{"$f":"'C3C'!F131+'C3C'!F132","v":12108000},{"$f":"'C3C'!G131+'C3C'!G132","v":92615000},{"$f":"D61/12*8","v":101108946},-8493946,-8.4007858216621115E-2,{"$f":"G61*12/8","v":138922500}]
["Storm Water Management",null,null,null,null,null,null,null,0,""]
["Public Toilets",null,null,null,null,null,null,null,0,""]
["Waste management",null,{"$f":"SUM(C65)","v":0},{"$f":"SUM(D65)","v":115159607},0,7484000,56840000,76773071.333333328,-19933071.333333328,-0.25963623686211429,0]
["Solid Waste",null,null,{"$f":"'C3C'!D86","v":115159607},null,{"$f":"'C3C'!F86","v":7484000},{"$f":"'C3C'!G86","v":56840000},{"$f":"D65/12*8","v":76773071.333333328},-19933071.333333328,-0.25963623686211429]
["Other",null,{"$f":"SUM(C67:C71)","v":0},{"$f":"SUM(D67:D71)","v":10535024},0,1893000,8065000,7023349.333333333,1041650.666666667,0.14831252401513281,12097500]
["Air Transport",null,null,null,null,null,null,null,0,""]
["Abattoirs",null,null,null,null,null,null,null,0,""]
["Tourism",null,null,null,null,null,null,null,0,""]
["Forestry",null,null,null,null,null,null,null,0,""]
["Markets",null,null,{"$f":"'C3C'!D67","v":10535024},null,{"$f":"'C3C'!F67","v":1893000},{"$f":"'C3C'!G67","v":8065000},{"$f":"D71/12*8","v":7023349.333333333},{"$f":"G71-H71","v":1041650.666666667},{"$f":"IF(I71=0,\"\",I71/H71)","v":0.14831252401513281},{"$f":"G71*12/8","v":12097500}]
[{"$f":"\"Total \"&A5","v":"Total Revenue - Standard"},2,{"$f":"C6+C16+C38+C53+C66","v":0},2069171135,0,133925000,1422242000,1379447423.3333333,{"$f":"G72-H72","v":42794576.666666746},{"$f":"IF(I72=0,\"\",I72/H72)","v":3.1022984959627384E-2},{"$f":"K6+K16+K38+K53+K66","v":2048103000}]
[]
["Expenditure - Standard"]
[{"$f":"A6","v":"Municipal governance and administration"},null,{"$f":"C76+C79+C80","v":0},276334673,0,26926073,213982073,184223115.33333334,{"$f":"G75-H75","v":29758957.666666657},{"$f":"IF(I75=0,\"\",I75/H75)","v":0.16153758779304536},320973109.5]
[{"$f":"A7","v":"Executive and council"},null,{"$f":"SUM(C77:C78)","v":0},142974437,0,16420073,113159073,95316291.333333328,17842781.666666672,0.18719550894262313,169738609.5]
["Mayor and Council",null,null,{"$f":"'C3C'!D174+'C3C'!D185+'C3C'!D196","v":105292437},null,{"$f":"'C3C'!F174+'C3C'!F185+'C3C'!F196","v":14169073},{"$f":"'C3C'!G174+'C3C'!G185+'C3C'!G196","v":84421073},{"$f":"D77/12*8","v":70194958},14226115,0.2026657669629206,{"$f":"G77*12/8","v":126631609.5}]
["Municipal Manager",null,null,{"$f":"'C3C'!D207-'C3C'!D212","v":37682000},null,{"$f":"'C3C'!F207-'C3C'!F212","v":2251000},{"$f":"'C3C'!G207-'C3C'!G212","v":28738000},{"$f":"D78/12*8","v":25121333.333333332},3616666.6666666679,0.14396794225359594,{"$f":"G78*12/8","v":43107000}]
["Budget and treasury office",null,null,{"$f":"'C3C'!D229-'C3C'!D235","v":63922738},null,{"$f":"'C3C'!F229-'C3C'!F235","v":4683000},{"$f":"'C3C'!G229-'C3C'!G235","v":61094000},{"$f":"D79/12*8","v":42615158.666666664},18478841.333333336,0.43362131953734528,{"$f":"G79*12/8","v":91641000}]
["Corporate services",null,{"$f":"SUM(C81:C84)","v":0},69437498,0,5823000,39729000,46291665.333333336,-6562665.3333333358,-0.14176775205811712,59593500]
["Human Resources",null,null,{"$f":"'C3C'!D240","v":15261743},null,{"$f":"'C3C'!F240","v":1160000},{"$f":"'C3C'!G240","v":8669000},{"$f":"D81/12*8","v":10174495.333333334},-1505495.333333334,-0.14796756831772104,{"$f":"G81*12/8","v":13003500}]
["Information Technology",null,null,{"$f":"'C3C'!D212","v":24155678},null,{"$f":"'C3C'!F212","v":3033000},{"$f":"'C3C'!G212","v":10382000},{"$f":"D82/12*8","v":16103785.333333334},-5721785.333333334,-0.35530685580425442,{"$f":"G82*12/8","v":15573000}]
["Property Services",null,null,null,null,null,null,{"$f":"D83/12*8","v":0},0,"",{"$f":"G83*12/8","v":0}]
["Other Admin",null,null,{"$f":"'C3C'!D219","v":30020077},null,{"$f":"'C3C'!F219","v":1630000},{"$f":"'C3C'!G219","v":20678000},{"$f":"D84/12*8","v":20013384.666666668},664615.33333333209,3.3208542403139009E-2,{"$f":"G84*12/8","v":31017000}]
["Community and public safety",null,{"$f":"C86+C95+C96+C102+C103","v":0},359204295,0,23136000,201676000,239469530,-37793530,-0.15782187403967426,302514000]
["Community and social services",null,{"$f":"SUM(C87:C94)","v":0},42187866,0,2948000,23234000,28125243.999999996,-4891243.9999999963,-0.17390938901721162,34851000]
["Libraries and Archives",null,null,{"$f":"'C3C'!D220","v":16320906},null,{"$f":"'C3C'!F220","v":1297000},{"$f":"'C3C'!G220","v":9792000},{"$f":"D87/12*8","v":10880604},-1088604,-0.10004996046175378,{"$f":"G87*12/8","v":14688000}]
["Museums & Art Galleries etc",null,null,null,null,null,null,0,0,"",0]
["Community halls and Facilities",null,null,{"$f":"'C3C'!D221","v":13478728},null,{"$f":"'C3C'!F221","v":1191000},{"$f":"'C3C'!G221","v":9889000},8985818.666666666,903181.33333333395,0.10051185838901126,14833500]
["Cemeteries & Crematoriums",null,null,null,null,null,null,0,0,"",0]
["Child Care",null,null,null,null,null,null,0,0,"",0]
["Aged Care",null,null,null,null,null,null,0,0,"",0]
["Other Community",null,null,{"$f":"'C3C'!D252","v":12388232},null,{"$f":"'C3C'!F252","v":460000},{"$f":"'C3C'!G252","v":3553000},8258821.333333333,-4705821.333333333,-0.56979333289851208,5329500]
["Other Social",null,null,null,null,null,null,0,0,"",0]
["Sport and recreation",null,null,{"$f":"'C3C'!D253","v":131385165},null,{"$f":"'C3C'!F253","v":7029000},{"$f":"'C3C'!G253","v":57504000},87590110,-30086110,-0.34348752387683951,86256000]
["Public safety",null,{"$f":"SUM(C97:C101)","v":0},162614466,0,11321000,104168000,108409644.00000001,-4241644.0000000149,-3.9126076274173673E-2,156252000]
["Police",null,null,{"$f":"'C3C'!D263+'C3C'!D264","v":57366839},null,{"$f":"'C3C'!F263+'C3C'!F264","v":4721000},{"$f":"'C3C'!G263+'C3C'!G264","v":35513000},{"$f":"D97/12*8","v":38244559.333333336},-2731559.3333333358,-7.1423475154348381E-2,{"$f":"G97*12/8","v":53269500}]
["Fire",null,null,{"$f":"'C3C'!D266","v":39064484},null,{"$f":"'C3C'!F266","v":2698000},{"$f":"'C3C'!G266","v":22382000},26042989.333333332,-3660989.3333333321,-0.14057485054711072,33573000]
["Civil Defence",null,null,{"$f":"'C3C'!D265","v":46975269},null,{"$f":"'C3C'!F265","v":3206000},{"$f":"'C3C'!G265","v":39528000},31316846,8211154,0.26219607172446419,59292000]
["Street Lighting",null,null,{"$f":"'C3C'!D310","v":10871920},null,{"$f":"'C3C'!F310","v":194000},{"$f":"'C3C'!G310","v":1883000},7247946.666666667,-5364946.666666667,-0.74020228257750242,2824500]
["Other",null,null,{"$f":"'C3C'!D318","v":8335954},null,{"$f":"'C3C'!F318","v":502000},{"$f":"'C3C'!G318","v":4862000},5557302.666666667,-695302.66666666698,-0.1251151337927249,7293000]
["Housing",null,null,{"$f":"'C3C'!D329","v":23016798},null,{"$f":"'C3C'!F329","v":1838000},{"$f":"'C3C'!G329","v":16770000},15344532,1425468,9.289745689213591E-2,25155000]
["Health",null,{"$f":"SUM(C104:C106)","v":0},0,0,0,0,0,0,"",0]
["Clinics",null,null,null,null,null,null,null,0,""]
["Ambulance",null,null,null,null,null,null,null,0,""]
["Other   ",null,null,null,null,null,null,null,0,""]
["Economic and environmental services",null,{"$f":"C108+C112+C118","v":0},159103672,0,5223000,41759000,106069114.66666667,-64310114.666666672,-0.60630386959265148,62638500]
["Planning and development",null,{"$f":"SUM(C109:C111)","v":0},34187490,0,1118000,9567000,22791660,-13224660,-0.58024119348919734,14350500]
["Economic Development/Planning ",null,null,{"$f":"'C3C'!D274","v":34187490},null,{"$f":"'C3C'!F274","v":1118000},{"$f":"'C3C'!G274","v":9567000},{"$f":"D109/12*8","v":22791660},-13224660,-0.58024119348919734,{"$f":"G109*12/8","v":14350500}]
["Town Planning/Building enforcement ",null,null,null,null,null,null,{"$f":"D110/12*8","v":0},0,"",{"$f":"G110*12/8","v":0}]
["Licensing & Regulation",null,null,null,null,null,null,{"$f":"D111/12*8","v":0},0,"",{"$f":"G111*12/8","v":0}]
["Road transport",null,{"$f":"SUM(C113:C117)","v":0},124916182,0,3345000,28408000,83277454.666666672,-54869454.666666672,-0.65887526085291337,42612000]
["Roads",null,null,{"$f":"'C3C'!D290","v":102278797},null,{"$f":"'C3C'!F290","v":845000},{"$f":"'C3C'!G290","v":10537000},{"$f":"D113/12*8","v":68185864.666666672},-57648864.666666672,-0.84546650465589657,{"$f":"G113*12/8","v":15805500}]
["Public Buses",null,null,null,null,null,null,{"$f":"D114/12*8","v":0},0,"",{"$f":"G114*12/8","v":0}]
["Parking Garages",null,null,null,null,null,null,{"$f":"D115/12*8","v":0},0,"",{"$f":"G115*12/8","v":0}]
["Vehicle Licensing and Testing",null,null,null,null,null,null,{"$f":"D116/12*8","v":0},0,"",{"$f":"G116*12/8","v":0}]
["Other",null,null,{"$f":"'C3C'!D285+'C3C'!D286+'C3C'!D287+'C3C'!D288+'C3C'!D289","v":22637385},null,{"$f":"'C3C'!F285+'C3C'!F286+'C3C'!F287+'C3C'!F288+'C3C'!F289","v":2500000},{"$f":"'C3C'!G285+'C3C'!G286+'C3C'!G287+'C3C'!G288+'C3C'!G289","v":17871000},{"$f":"D117/12*8","v":15091590},2779410,0.18416946126948849,{"$f":"G117*12/8","v":26806500}]
["Environmental protection",null,{"$f":"SUM(C119:C121)","v":0},0,0,760000,3784000,0,3784000,{"$error":"#DIV/0!"},5676000]
["Pollution Control",null,null,null,null,null,null,null,0,"",{"$f":"G119*12/8","v":0}]
["Biodiversity & Landscape",null,null,null,null,null,null,null,0,"",{"$f":"G120*12/8","v":0}]
["Other",null,null,{"$f":"'C3C'!D255","v":0},null,{"$f":"'C3C'!F255","v":760000},{"$f":"'C3C'!G255","v":3784000},{"$f":"D121/12*8","v":0},3784000,{"$error":"#DIV/0!"},{"$f":"G121*12/8","v":5676000}]
["Trading services",null,{"$f":"C123+C126+C129+C133","v":0},{"$f":"D123+D126+D129+D133","v":1268684438},0,46874000,329739000,845789625.33333337,-516050625.33333337,-0.61014064239668719,{"$f":"K123+K126+K129+K133","v":494608500}]
["Electricity",null,{"$f":"SUM(C124:C125)","v":0},572453401,0,21373000,148376000,381635600.66666669,-233259600.66666669,-0.61121027561158647,222564000]
["Electricity Distribution",null,null,{"$f":"'C3C'!D306-'C3C'!D310","v":572453401},null,{"$f":"'C3C'!F306-'C3C'!F310","v":21373000},{"$f":"'C3C'!G306-'C3C'!G310","v":148376000},{"$f":"D124/12*8","v":381635600.66666669},-233259600.66666669,-0.61121027561158647,{"$f":"G124*12/8","v":222564000}]
["Electricity Generation",null,null,null,null,null,null,null,0,"",{"$f":"G125*12/8","v":0}]
["Water",null,{"$f":"SUM(C127:C128)","v":0},474514794,0,14782000,95098000,316343196,-221245196,-0.69938345062430229,142647000]
["Water Distribution",null,null,{"$f":"'C3C'!D296+'C3C'!D297+'C3C'!D298","v":474514794},null,{"$f":"'C3C'!F296+'C3C'!F297+'C3C'!F298","v":14782000},{"$f":"'C3C'!G296+'C3C'!G297+'C3C'!G298","v":95098000},{"$f":"D127/12*8","v":316343196},-221245196,-0.69938345062430229,{"$f":"G127*12/8","v":142647000}]
["Water Storage",null,null,null,null,null,null,null,0,"",{"$f":"G128*12/8","v":0}]
["Waste water management",null,{"$f":"SUM(C130:C132)","v":0},120576463,0,4275000,39754000,80384308.666666672,-40630308.666666672,-0.5054507445619798,59631000]
["Sewerage",null,null,{"$f":"'C3C'!D299+'C3C'!D300","v":100278797},null,{"$f":"'C3C'!F299+'C3C'!F300","v":3083000},{"$f":"'C3C'!G299+'C3C'!G300","v":30751000},{"$f":"D130/12*8","v":66852531.333333336},-36101531.333333336,-0.54001741764014188,{"$f":"G130*12/8","v":46126500}]
["Storm Water Management",null,null,{"$f":"'C3C'!D291+'C3C'!D292","v":20297666},null,{"$f":"'C3C'!F291+'C3C'!F292","v":1192000},{"$f":"'C3C'!G291+'C3C'!G292","v":9003000},{"$f":"D131/12*8","v":13531777.333333334},-4528777.333333334,-0.33467719884640929,{"$f":"G131*12/8","v":13504500}]
["Public Toilets",null,null,null,null,null,null,null,0,"",{"$f":"G132*12/8","v":0}]
["Waste management",null,{"$f":"SUM(C134)","v":0},101139780,0,6444000,46511000,67426520,-20915520,-0.31019723396669441,69766500]
["Solid Waste",null,null,{"$f":"'C3C'!D254","v":101139780},null,{"$f":"'C3C'!F254","v":6444000},{"$f":"'C3C'!G254","v":46511000},{"$f":"D134/12*8","v":67426520},-20915520,-0.31019723396669441,{"$f":"G134*12/8","v":69766500}]
["Other",null,{"$f":"SUM(C136:C140)","v":0},5345438,0,459000,4261000,3563625.3333333335,697374.66666666651,0.19569247646310736,6391500]
["Air Transport",null,null,null,null,null,null,null,0,"",{"$f":"G136*12/8","v":0}]
["Abattoirs",null,null,null,null,null,null,null,0,"",{"$f":"G137*12/8","v":0}]
["Tourism",null,null,null,null,null,null,null,0,"",{"$f":"G138*12/8","v":0}]
["Forestry",null,null,null,null,null,null,null,{"$f":"G139-H139","v":0},{"$f":"IF(I139=0,\"\",I139/H139)","v":""},{"$f":"G139*12/8","v":0}]
[{"$f":"A71","v":"Markets"},null,null,{"$f":"'C3C'!D235","v":5345438},null,{"$f":"'C3C'!F235","v":459000},{"$f":"'C3C'!G235","v":4261000},{"$f":"D140/12*8","v":3563625.3333333335},{"$f":"G140-H140","v":697374.66666666651},{"$f":"IF(I140=0,\"\",I140/H140)","v":0.19569247646310736},{"$f":"G140*12/8","v":6391500}]
[{"$f":"\"Total \"&A74","v":"Total Expenditure - Standard"},3,{"$f":"C75+C85+C107+C122+C135","v":0},{"$f":"D75+D85+D107+D122+D135","v":2068672516},0,102618073,791417073,1379115010.6666667,-587697937.66666675,{"$f":"IF(I141=0,\"\",I141/H141)","v":-0.42614135378206963},{"$f":"K75+K85+K107+K122+K135","v":1187125609.5}]
[{"$f":"result","v":"Surplus/ (Deficit) for the year"},null,{"$f":"C72-C141","v":0},498619,0,31306927,630824927,332412.66666650772,{"$f":"G142-H142","v":630492514.33333349},{"$f":"IF(I142=0,\"\",I142/H142)","v":1896.7162733478917},860977390.5]
[{"$f":"head27a","v":"References"}]
["1. Government Finance Statistics Functions and Sub-functions are standardised to assist national and international accounts and comparison"]
["2. Total Revenue by Standard Classification must reconcile to total operating revenue shown in Financial Performance (revenue and expenditure)"]
["3. Total Expenditure by Standard Classification must reconcile to total operating expenditure shown in Financial Performance (revenue and expenditure)"]
["4. All amounts must be classified under a Standard (modified GFS) classification. The GFS function 'Other' is only for Abbatoirs, Air Transport, Markets and Tourism - and if used must be supported by footnotes. Nothing else may be placed under 'Other'. Assign associate share to relevant classification"]
[]
[]
["check oprev balance",null,{"$f":"C72","v":0},0,0,0,0,0,0,null,0]
["check opexp balance",null,0,0,0,0,0,0,0,null,0]

{"sheet":"C3-FinPerf V","index":9,"n_rows":43,"n_cols":11,"rows_kept":43,"cut":false,"hidden":false,"merged":[[0,0,0,10],[1,1,3,1],[1,3,1,10]]}
[{"$f":"muni& \" - \"&S71C& \" - \"&date","v":"FS184 Matjhabeng - Table C3 Monthly Budget Statement - Financial Performance (revenue and expenditure by municipal vote) - M08 February"}]
[{"$f":"Vdesc","v":"Vote Description"},{"$f":"head27","v":"Ref"},{"$f":"Head1","v":"2014/15"},{"$f":"Head2","v":"Budget Year 2015/16"}]
[null,null,{"$f":"Head5","v":"Audited Outcome"},{"$f":"Head6","v":"Original Budget"},{"$f":"Head7","v":"Adjusted Budget"},{"$f":"Head38","v":"Monthly actual"},{"$f":"Head39","v":"YearTD actual"},{"$f":"Head40","v":"YearTD budget"},{"$f":"Head41","v":"YTD variance"},{"$f":"Head41","v":"YTD variance"},{"$f":"Head8","v":"Full Year Forecast"}]
["R thousands",null,null,null,null,null,null,null,null,"%"]
["Revenue by Vote",1]
[{"$f":"'Org structure'!A2","v":"Vote 1 - COUNCIL GENERAL"},null,{"$f":"'C3C'!C6","v":0},{"$f":"'C3C'!D6","v":406586000},{"$f":"'C3C'!E6","v":0},{"$f":"'C3C'!F6","v":0},{"$f":"'C3C'!G6","v":329452000},{"$f":"'C3C'!H6","v":271057333.33333331},{"$f":"G6-H6","v":58394666.666666687},{"$f":"IF(I6=0,\"\",I6/H6)","v":0.21543289734521118},{"$f":"'C3C'!K6","v":494178000}]
[{"$f":"'Org structure'!A3","v":"Vote 2 - OFFICE OF THE EXECUTIVE MAYOR"},null,{"$f":"'C3C'!C17","v":0},{"$f":"'C3C'!D17","v":0},{"$f":"'C3C'!E17","v":0},{"$f":"'C3C'!F17","v":0},{"$f":"'C3C'!G17","v":0},{"$f":"'C3C'!H17","v":0},{"$f":"G7-H7","v":0},{"$f":"IF(I7=0,\"\",I7/H7)","v":""},{"$f":"'C3C'!K17","v":0}]
[{"$f":"'Org structure'!A4","v":"Vote 3 - OFFICE OF THE SPEAKER"},null,{"$f":"'C3C'!C28","v":0},{"$f":"'C3C'!D28","v":0},{"$f":"'C3C'!E28","v":0},{"$f":"'C3C'!F28","v":0},{"$f":"'C3C'!G28","v":0},{"$f":"'C3C'!H28","v":0},0,"",{"$f":"'C3C'!K28","v":0}]
[{"$f":"'Org structure'!A5","v":"Vote 4 - OFFICE OF THE MUNICIPAL MANAGER"},null,{"$f":"'C3C'!C39","v":0},{"$f":"'C3C'!D39","v":117567000},{"$f":"'C3C'!E39","v":0},{"$f":"'C3C'!F39","v":10968000},{"$f":"'C3C'!G39","v":76267000},{"$f":"'C3C'!H39","v":78378000},-2111000,-2.6933578300033172E-2,{"$f":"'C3C'!K39","v":114400500}]
[{"$f":"'Org structure'!A6","v":"Vote 5 - CORPORATE SUPPORT SERVICES"},null,{"$f":"'C3C'!C50","v":0},{"$f":"'C3C'!D50","v":0},{"$f":"'C3C'!E50","v":0},{"$f":"'C3C'!F50","v":0},{"$f":"'C3C'!G50","v":0},{"$f":"'C3C'!H50","v":0},0,"",{"$f":"'C3C'!K50","v":0}]
[{"$f":"'Org structure'!A7","v":"Vote 6 - FINANCE"},null,{"$f":"'C3C'!C61","v":0},{"$f":"'C3C'!D61","v":278786543},{"$f":"'C3C'!E61","v":0},{"$f":"'C3C'!F61","v":31864000},{"$f":"'C3C'!G61","v":276813000},{"$f":"'C3C'!H61","v":185857695.33333334},90955304.666666657,0.48938142971986986,{"$f":"'C3C'!K61","v":415219500}]
[{"$f":"'Org structure'!A8","v":"Vote 7 - HUMAN RESOURCES"},null,{"$f":"'C3C'!C72","v":0},{"$f":"'C3C'!D72","v":0},{"$f":"'C3C'!E72","v":0},{"$f":"'C3C'!F72","v":0},{"$f":"'C3C'!G72","v":0},{"$f":"'C3C'!H72","v":0},0,"",{"$f":"'C3C'!K72","v":0}]
[{"$f":"'Org structure'!A9","v":"Vote 8 - COMMUNITY SERVICES"},null,{"$f":"'C3C'!C83","v":0},{"$f":"'C3C'!D83","v":115159607},{"$f":"'C3C'!E83","v":0},{"$f":"'C3C'!F83","v":7484000},{"$f":"'C3C'!G83","v":56840000},{"$f":"'C3C'!H83","v":76773071.333333328},-19933071.333333328,-0.25963623686211429,{"$f":"'C3C'!K83","v":85260000}]
[{"$f":"'Org structure'!A10","v":"Vote 9 - PUBLIC SAFETY AND TRANSPORT"},null,{"$f":"'C3C'!C94","v":0},{"$f":"'C3C'!D94","v":4744531},{"$f":"'C3C'!E94","v":0},{"$f":"'C3C'!F94","v":219000},{"$f":"'C3C'!G94","v":1747000},{"$f":"'C3C'!H94","v":3163020.6666666665},-1416020.6666666665,-0.44767986551252376,{"$f":"'C3C'!K94","v":2620500}]
[{"$f":"'Org structure'!A11","v":"Vote 10 - ECONOMIC DEVELOPMENT"},null,{"$f":"'C3C'!C105","v":0},{"$f":"'C3C'!D105","v":14643021},{"$f":"'C3C'!E105","v":0},{"$f":"'C3C'!F105","v":0},{"$f":"'C3C'!G105","v":0},{"$f":"'C3C'!H105","v":9762014},-9762014,-1,{"$f":"'C3C'!K105","v":0}]
[{"$f":"'Org structure'!A12","v":"Vote 11 - ENGINEERING SERVICES"},null,{"$f":"'C3C'!C116","v":0},{"$f":"'C3C'!D116","v":17108115},{"$f":"'C3C'!E116","v":0},{"$f":"'C3C'!F116","v":0},{"$f":"'C3C'!G116","v":0},{"$f":"'C3C'!H116","v":11405410},-11405410,-1,{"$f":"'C3C'!K116","v":0}]
[{"$f":"'Org structure'!A13","v":"Vote 12 - WATER"},null,{"$f":"'C3C'!C127","v":0},{"$f":"'C3C'!D127","v":355552684},{"$f":"'C3C'!E127","v":0},{"$f":"'C3C'!F127","v":42170000},{"$f":"'C3C'!G127","v":327682000},{"$f":"'C3C'!H127","v":237035122.66666666},90646877.333333343,0.38241960226631289,{"$f":"'C3C'!K127","v":491523000}]
[{"$f":"'Org structure'!A14","v":"Vote 13 - ELECTRICITY"},null,{"$f":"'C3C'!C138","v":0},{"$f":"'C3C'!D138","v":748264548},{"$f":"'C3C'!E138","v":0},{"$f":"'C3C'!F138","v":40039000},{"$f":"'C3C'!G138","v":341397000},{"$f":"'C3C'!H138","v":498843032},-157446032,-0.31562239401992892,{"$f":"'C3C'!K138","v":512095500}]
[{"$f":"'Org structure'!A15","v":"Vote 14 - MECHANICAL WORKSHOP"},null,{"$f":"'C3C'!C149","v":0},{"$f":"'C3C'!D149","v":0},{"$f":"'C3C'!E149","v":0},{"$f":"'C3C'!F149","v":0},{"$f":"'C3C'!G149","v":0},{"$f":"'C3C'!H149","v":0},0,"",{"$f":"'C3C'!K149","v":0}]
[{"$f":"'Org structure'!A16","v":"Vote 15 - HOUSING SERVICES"},null,{"$f":"'C3C'!C160","v":0},{"$f":"'C3C'!D160","v":10759086},{"$f":"'C3C'!E160","v":0},{"$f":"'C3C'!F160","v":1181000},{"$f":"'C3C'!G160","v":12044000},{"$f":"'C3C'!H160","v":7172724},4871276,0.67913891570343432,{"$f":"'C3C'!K160","v":18066000}]
["Total Revenue by Vote",2,{"$f":"SUM(C6:C20)","v":0},{"$f":"SUM(D6:D20)","v":2069171135},0,133925000,1422242000,1379447423.3333333,42794576.666666687,3.1022984959627339E-2,{"$f":"SUM(K6:K20)","v":2133363000}]
[]
["Expenditure by Vote",1]
[{"$f":"'Org structure'!A2","v":"Vote 1 - COUNCIL GENERAL"},null,{"$f":"'C3C'!C174","v":0},{"$f":"'C3C'!D174","v":61938606},{"$f":"'C3C'!E174","v":0},{"$f":"'C3C'!F174","v":11645863},{"$f":"'C3C'!G174","v":61733863},{"$f":"'C3C'!H174","v":41292404},{"$f":"G24-H24","v":20441459},{"$f":"IF(I24=0,\"\",I24/H24)","v":0.49504163041706167},{"$f":"'C3C'!K174","v":92600794.5}]
[{"$f":"'Org structure'!A3","v":"Vote 2 - OFFICE OF THE EXECUTIVE MAYOR"},null,{"$f":"'C3C'!C185","v":0},{"$f":"'C3C'!D185","v":20142109},{"$f":"'C3C'!E185","v":0},{"$f":"'C3C'!F185","v":709939},{"$f":"'C3C'!G185","v":7304939},{"$f":"'C3C'!H185","v":13428072.666666668},-6123133.6666666679,-0.45599497550132417,{"$f":"'C3C'!K185","v":10957408.5}]
[{"$f":"'Org structure'!A4","v":"Vote 3 - OFFICE OF THE SPEAKER"},null,{"$f":"'C3C'!C196","v":0},{"$f":"'C3C'!D196","v":23211722},{"$f":"'C3C'!E196","v":0},{"$f":"'C3C'!F196","v":1813271},{"$f":"'C3C'!G196","v":15382271},{"$f":"'C3C'!H196","v":15474481.333333334},-92210.333333333954,-5.9588642324770614E-3,{"$f":"'C3C'!K196","v":23073406.5}]
[{"$f":"'Org structure'!A5","v":"Vote 4 - OFFICE OF THE MUNICIPAL MANAGER"},null,{"$f":"'C3C'!C207","v":0},{"$f":"'C3C'!D207","v":61837678},{"$f":"'C3C'!E207","v":0},{"$f":"'C3C'!F207","v":5284000},{"$f":"'C3C'!G207","v":39120000},{"$f":"'C3C'!H207","v":41225118.666666664},-2105118.6666666642,-5.1063980765901275E-2,{"$f":"'C3C'!K207","v":58680000}]
[{"$f":"'Org structure'!A6","v":"Vote 5 - CORPORATE SUPPORT SERVICES"},null,{"$f":"'C3C'!C218","v":0},{"$f":"'C3C'!D218","v":59819711},{"$f":"'C3C'!E218","v":0},{"$f":"'C3C'!F218","v":4118000},{"$f":"'C3C'!G218","v":40359000},{"$f":"'C3C'!H218","v":39879807.333333336},479192.66666666418,1.2015922310289934E-2,{"$f":"'C3C'!K218","v":60538500}]
[{"$f":"'Org structure'!A7","v":"Vote 6 - FINANCE"},null,{"$f":"'C3C'!C229","v":0},{"$f":"'C3C'!D229","v":69268176},{"$f":"'C3C'!E229","v":0},{"$f":"'C3C'!F229","v":5142000},{"$f":"'C3C'!G229","v":65355000},{"$f":"'C3C'!H229","v":46178784},19176216,0.41526030655116425,{"$f":"'C3C'!K229","v":98032500}]
[{"$f":"'Org structure'!A8","v":"Vote 7 - HUMAN RESOURCES"},null,{"$f":"'C3C'!C240","v":0},{"$f":"'C3C'!D240","v":15261743},{"$f":"'C3C'!E240","v":0},{"$f":"'C3C'!F240","v":1160000},{"$f":"'C3C'!G240","v":8669000},{"$f":"'C3C'!H240","v":10174495.333333334},-1505495.333333334,{"$f":"IF(I30=0,\"\",I30/H30)","v":-0.14796756831772104},{"$f":"'C3C'!K240","v":13003500}]
[{"$f":"'Org structure'!A9","v":"Vote 8 - COMMUNITY SERVICES"},null,{"$f":"'C3C'!C251","v":0},{"$f":"'C3C'!D251","v":244913177},{"$f":"'C3C'!E251","v":0},{"$f":"'C3C'!F251","v":14693000},{"$f":"'C3C'!G251","v":111352000},{"$f":"'C3C'!H251","v":163275451.33333331},-51923451.333333313,-0.318011378375121,{"$f":"'C3C'!K251","v":167028000}]
[{"$f":"'Org structure'!A10","v":"Vote 9 - PUBLIC SAFETY AND TRANSPORT"},null,{"$f":"'C3C'!C262","v":0},{"$f":"'C3C'!D262","v":143406592},{"$f":"'C3C'!E262","v":0},{"$f":"'C3C'!F262","v":10625000},{"$f":"'C3C'!G262","v":97423000},{"$f":"'C3C'!H262","v":95604394.666666672},1818605.3333333284,1.9022193903052882E-2,{"$f":"'C3C'!K262","v":146134500}]
[{"$f":"'Org structure'!A11","v":"Vote 10 - ECONOMIC DEVELOPMENT"},null,{"$f":"'C3C'!C273","v":0},{"$f":"'C3C'!D273","v":34187490},{"$f":"'C3C'!E273","v":0},{"$f":"'C3C'!F273","v":1118000},{"$f":"'C3C'!G273","v":9567000},{"$f":"'C3C'!H273","v":22791660},-13224660,{"$f":"IF(I33=0,\"\",I33/H33)","v":-0.58024119348919734},{"$f":"'C3C'!K273","v":14350500}]
[{"$f":"'Org structure'!A12","v":"Vote 11 - ENGINEERING SERVICES"},null,{"$f":"'C3C'!C284","v":0},{"$f":"'C3C'!D284","v":145213848},{"$f":"'C3C'!E284","v":0},{"$f":"'C3C'!F284","v":4537000},{"$f":"'C3C'!G284","v":37411000},{"$f":"'C3C'!H284","v":96809232},-59398232,{"$f":"IF(I34=0,\"\",I34/H34)","v":-0.613559582829869},{"$f":"'C3C'!K284","v":56116500}]
[{"$f":"'Org structure'!A13","v":"Vote 12 - WATER"},null,{"$f":"'C3C'!C295","v":0},{"$f":"'C3C'!D295","v":574793591},{"$f":"'C3C'!E295","v":0},{"$f":"'C3C'!F295","v":17865000},{"$f":"'C3C'!G295","v":125849000},{"$f":"'C3C'!H295","v":383195727.33333331},-257346727.33333331,{"$f":"IF(I35=0,\"\",I35/H35)","v":-0.67158036736008075},{"$f":"'C3C'!K295","v":188773500}]
[{"$f":"'Org structure'!A14","v":"Vote 13 - ELECTRICITY"},null,{"$f":"'C3C'!C306","v":0},{"$f":"'C3C'!D306","v":583325321},{"$f":"'C3C'!E306","v":0},{"$f":"'C3C'!F306","v":21567000},{"$f":"'C3C'!G306","v":150259000},{"$f":"'C3C'!H306","v":388883547.33333331},-238624547.33333331,{"$f":"IF(I36=0,\"\",I36/H36)","v":-0.61361440711400217},{"$f":"'C3C'!K306","v":225388500}]
[{"$f":"'Org structure'!A15","v":"Vote 14 - MECHANICAL WORKSHOP"},null,{"$f":"'C3C'!C317","v":0},{"$f":"'C3C'!D317","v":8335954},{"$f":"'C3C'!E317","v":0},{"$f":"'C3C'!F317","v":502000},{"$f":"'C3C'!G317","v":4862000},{"$f":"'C3C'!H317","v":5557302.666666667},-695302.66666666698,{"$f":"IF(I37=0,\"\",I37/H37)","v":-0.1251151337927249},{"$f":"'C3C'!K317","v":7293000}]
[{"$f":"'Org structure'!A16","v":"Vote 15 - HOUSING SERVICES"},null,{"$f":"'C3C'!C328","v":0},{"$f":"'C3C'!D328","v":23016798},{"$f":"'C3C'!E328","v":0},{"$f":"'C3C'!F328","v":1838000},{"$f":"'C3C'!G328","v":16770000},{"$f":"'C3C'!H328","v":15344532},1425468,9.289745689213591E-2,{"$f":"'C3C'!K328","v":25155000}]
["Total Expenditure by Vote",2,{"$f":"SUM(C24:C38)","v":0},{"$f":"SUM(D24:D38)","v":2068672516},0,102618073,791417073,1379115010.6666665,-587697937.66666663,{"$f":"IF(I39=0,\"\",I39/H39)","v":-0.42614135378206958},{"$f":"SUM(K24:K38)","v":1187125609.5}]
[{"$f":"result","v":"Surplus/ (Deficit) for the year"},2,{"$f":"C21-C39","v":0},498619,0,31306927,630824927,332412.66666674614,{"$f":"I21-I39","v":630492514.33333325},{"$f":"IF(I40=0,\"\",I40/H40)","v":1896.7162733465307},{"$f":"K21-K39","v":946237390.5}]
[{"$f":"head27a","v":"References"}]
["1. Insert 'Vote'; e.g. Department, if different to standard classification structure"]
["2. Must reconcile to Monthly Budget Statement - Financial Performance Statement (standard classification)"]

{"sheet":"C3C","index":10,"n_rows":348,"n_cols":23,"rows_kept":348,"cut":false,"hidden":false,"merged":[[1,11,1,22],[1,3,1,10]]}
[{"$f":"muni& \" - \"&S71C& \" - \"&\"A\"& \" - \"&date","v":"FS184 Matjhabeng - Table C3 Monthly Budget Statement - Financial Performance (revenue and expenditure by municipal vote) - A - M08 February"}]
[{"$f":"Vdesc","v":"Vote Description"},{"$f":"head27","v":"Ref"},{"$f":"Head1","v":"2014/15"},{"$f":"Head2","v":"Budget Year 2015/16"},null,null,null,null,null,null,null,{"$f":"Head4","v":{"$error":"#REF!"}}]
["R thousand",null,{"$f":"Head5","v":"Audited Outcome"},{"$f":"Head6","v":"Original Budget"},{"$f":"Head7","v":"Adjusted Budget"},{"$f":"Head38","v":"Monthly actual"},{"$f":"Head39","v":"YearTD actual"},{"$f":"Head40","v":"YearTD budget"},{"$f":"Head41","v":"YTD variance"},{"$f":"Head41","v":"YTD variance"},{"$f":"Head8","v":"Full Year Forecast"},{"$f":"Head12","v":"Forecast 2010/11"},{"$f":"Head13","v":"Forecast 2011/12"},{"$f":"Head14","v":"Forecast 2012/13"},{"$f":"Head15","v":"Forecast 2013/14"},{"$f":"Head16","v":"Forecast 2014/15"},{"$f":"Head17","v":"Forecast 2015/16"},{"$f":"Head18","v":"Forecast 2016/17"},{"$f":"Head19","v":"Forecast 2017/18"},{"$f":"Head20","v":"Forecast 2018/19"},{"$f":"Head21","v":"Forecast 2019/20"},{"$f":"Head22","v":"Forecast 2020/21"},{"$f":"Head23","v":"Forecast 2021/22"}]
[null,null,null,null,null,null,null,null,null,"%"]
["Revenue by Vote",1]
[{"$f":"'Org structure'!A2","v":"Vote 1 - COUNCIL GENERAL"},null,{"$f":"SUM(C7:C16)","v":0},{"$f":"SUM(D7:D16)","v":406586000},0,0,329452000,271057333.33333331,{"$f":"G6-H6","v":58394666.666666687},{"$f":"IF(I6=0,\"\",I6/H6)","v":0.21543289734521118},494178000]
[{"$f":"'Org structure'!E3","v":"1.1 - Council"},null,null,406586000,null,0,{"$f":"F7+211219000+429000+600000+38724000+78158000+322000","v":329452000},{"$f":"D7/12*8","v":271057333.33333331},58394666.666666687,0.21543289734521118,{"$f":"G7*12/8","v":494178000}]
[{"$f":"'Org structure'!E4","v":0},null,null,null,null,null,null,null,0,""]
[{"$f":"'Org structure'!E5","v":0},null,null,null,null,null,null,null,0,""]
[{"$f":"'Org structure'!E6","v":0},null,null,null,null,null,null,null,0,""]
[{"$f":"'Org structure'!E7","v":0},null,null,null,null,null,null,null,0,""]
[{"$f":"'Org structure'!E8","v":0},null,null,null,null,null,null,null,0,""]
[{"$f":"'Org structure'!E9","v":0},null,null,null,null,null,null,null,0,""]
[{"$f":"'Org structure'!E10","v":0},null,null,null,null,null,null,null,0,""]
[{"$f":"'Org structure'!E11","v":0},null,null,null,null,null,null,null,0,""]
[{"$f":"'Org structure'!E12","v":0},null,null,null,null,null,null,null,0,""]
[{"$f":"'Org structure'!A3","v":"Vote 2 - OFFICE OF THE EXECUTIVE MAYOR"},null,{"$f":"SUM(C18:C27)","v":0},{"$f":"SUM(D18:D27)","v":0},0,0,0,0,0,"",0]
[{"$f":"'Org structure'!E14","v":"2.1 - Executive Mayor"},null,null,null,null,null,{"$f":"F18","v":0},{"$f":"D18/12*8","v":0},0,"",{"$f":"G18*12/8","v":0}]
[{"$f":"'Org structure'!E15","v":"2.2 - Mayoral Committee"},null,null,null,null,null,0,{"$f":"D19/12*8","v":0},0,"",{"$f":"G19*12/8","v":0}]
[{"$f":"'Org structure'!E16","v":0},null,null,null,null,null,null,null,0,"",{"$f":"G20*12/8","v":0}]
[{"$f":"'Org structure'!E17","v":0},null,null,null,null,null,null,null,0,""]
[{"$f":"'Org structure'!E18","v":0},null,null,null,null,null,null,null,0,""]
[{"$f":"'Org structure'!E19","v":0},null,null,null,null,null,null,null,0,""]
[{"$f":"'Org structure'!E20","v":0},null,null,null,null,null,null,null,0,""]
[{"$f":"'Org structure'!E21","v":0},null,null,null,null,null,null,null,0,""]
[{"$f":"'Org structure'!E22","v":0},null,null,null,null,null,null,null,0,""]
[{"$f":"'Org structure'!E23","v":0},null,null,null,null,null,null,null,0,""]
[{"$f":"'Org structure'!A4","v":"Vote 3 - OFFICE OF THE SPEAKER"},null,{"$f":"SUM(C29:C38)","v":0},0,0,0,0,0,0,"",0]
[{"$f":"'Org structure'!E25","v":"3.1 - Speaker"},null,null,null,null,null,{"$f":"F29","v":0},{"$f":"D29/12*8","v":0},0,"",{"$f":"G29*12/8","v":0}]
[{"$f":"'Org structure'!E26","v":"3.2 - Political Appointments"},null,null,null,null,null,0,{"$f":"D30/12*8","v":0},0,"",{"$f":"G30*12/8","v":0}]
[{"$f":"'Org structure'!E27","v":0},null,null,null,null,null,null,null,0,""]
[{"$f":"'Org structure'!E28","v":0},null,null,null,null,null,null,null,0,""]
[{"$f":"'Org structure'!E29","v":0},null,null,null,null,null,null,null,0,""]
[{"$f":"'Org structure'!E30","v":0},null,null,null,null,null,null,null,0,""]
[{"$f":"'Org structure'!E31","v":0},null,null,null,null,null,null,null,0,""]
[{"$f":"'Org structure'!E32","v":0},null,null,null,null,null,null,null,0,""]
[{"$f":"'Org structure'!E33","v":0},null,null,null,null,null,null,null,0,""]
[{"$f":"'Org structure'!E34","v":0},null,null,null,null,null,null,null,0,""]
[{"$f":"'Org structure'!A5","v":"Vote 4 - OFFICE OF THE MUNICIPAL MANAGER"},null,{"$f":"SUM(C40:C49)","v":0},117567000,0,10968000,76267000,78378000,-2111000,-2.6933578300033172E-2,114400500]
[{"$f":"'Org structure'!E36","v":"4.1 - Municipal Manager"},null,null,117567000,null,10968000,{"$f":"F40+8338000+7149000+9539000+9913000+9752000+10044000+10564000","v":76267000},{"$f":"D40/12*8","v":78378000},-2111000,-2.6933578300033172E-2,{"$f":"G40*12/8","v":114400500}]
[{"$f":"'Org structure'!E37","v":"4.2 - IDP"},null,null,null,null,null,{"$f":"F41","v":0},0,0,"",0]
[{"$f":"'Org structure'!E38","v":"4.3 - Internal Audit"},null,null,null,null,null,0,0,0,"",0]
[{"$f":"'Org structure'!E39","v":"4.4 - Organisation & Workstudy"},null,null,null,null,null,0,0,0,"",0]
[{"$f":"'Org structure'!E40","v":"4.5 - IT"},null,null,null,null,null,0,0,0,"",0]
[{"$f":"'Org structure'!E41","v":"4.6 - Legal Services"},null,null,null,null,null,0,0,0,"",0]
[{"$f":"'Org structure'!E42","v":0},null,null,null,null,null,null,null,0,""]
[{"$f":"'Org structure'!E43","v":0},null,null,null,null,null,null,null,0,""]
[{"$f":"'Org structure'!E44","v":0},null,null,null,null,null,null,null,0,""]
[{"$f":"'Org structure'!E45","v":0},null,null,null,null,null,null,null,0,""]
[{"$f":"'Org structure'!A6","v":"Vote 5 - CORPORATE SUPPORT SERVICES"},null,{"$f":"SUM(C51:C60)","v":0},{"$f":"SUM(D51:D60)","v":0},0,0,0,0,0,"",0]
[{"$f":"'Org structure'!E47","v":"5.1 - Corporate Services Admin"},null,null,null,null,null,{"$f":"F51","v":0},{"$f":"D51/12*8","v":0},0,"",{"$f":"G51*12/8","v":0}]
[{"$f":"'Org structure'!E48","v":"5.2 - Libraries"},null,null,null,null,null,0,{"$f":"D52/12*8","v":0},0,"",{"$f":"G52*12/8","v":0}]
[{"$f":"'Org structure'!E49","v":"5.3 - Halls & Offices"},null,null,null,null,null,0,{"$f":"D53/12*8","v":0},0,"",{"$f":"G53*12/8","v":0}]
[{"$f":"'Org structure'!E50","v":0},null,null,null,null,null,null,null,0,""]
[{"$f":"'Org structure'!E51","v":0},null,null,null,null,null,null,null,0,""]
[{"$f":"'Org structure'!E52","v":0},null,null,null,null,null,null,null,0,""]
[{"$f":"'Org structure'!E53","v":0},null,null,null,null,null,null,null,0,""]
[{"$f":"'Org structure'!E54","v":0},null,null,null,null,null,null,null,0,""]
[{"$f":"'Org structure'!E55","v":0},null,null,null,null,null,null,null,0,""]
[{"$f":"'Org structure'!E56","v":0},null,null,null,null,null,null,null,0,""]
[{"$f":"'Org structure'!A7","v":"Vote 6 - FINANCE"},null,{"$f":"SUM(C62:C71)","v":0},{"$f":"SUM(D62:D71)","v":278786543},0,31864000,276813000,185857695.33333334,90955304.666666657,0.48938142971986986,415219500]
[{"$f":"'Org structure'!E58","v":"6.1 - Administration"},null,null,null,null,null,{"$f":"F62","v":0},{"$f":"D62/12*8","v":0},0,"",{"$f":"G62*12/8","v":0}]
[{"$f":"'Org structure'!E59","v":"6.2 - Expenditure"},null,null,null,null,null,0,0,0,"",0]
[{"$f":"'Org structure'!E60","v":"6.3 - Budget Control & Salaries"},null,null,null,null,null,0,0,0,"",0]
[{"$f":"'Org structure'!E61","v":"6.4 - Stores"},null,null,null,null,null,0,0,0,"",0]
[{"$f":"'Org structure'!E62","v":"6.6 - Revenue"},null,null,268251519,null,29971000,{"$f":"F66+56865000+22461000+22264000+29858000+28270000+47420000+31639000","v":268748000},178834346,89913654,0.50277620608739215,403122000]
[{"$f":"'Org structure'!E63","v":"6.7 - Fresh Produce Market"},null,null,10535024,null,1893000,{"$f":"F67+730000+734000+867000+880000+971000+980000+1010000","v":8065000},7023349.333333333,1041650.666666667,0.14831252401513281,12097500]
[{"$f":"'Org structure'!E64","v":"6.8 - Valuation"},null,null,null,null,null,0,0,0,"",0]
[{"$f":"'Org structure'!E65","v":"6.8 - Credit Contol"},null,null,null,null,null,0,0,0,"",0]
[{"$f":"'Org structure'!E66","v":0},null,null,null,null,null,null,null,{"$f":"G70-H70","v":0},{"$f":"IF(I70=0,\"\",I70/H70)","v":""}]
[{"$f":"'Org structure'!E67","v":0},null,null,null,null,null,null,null,0,""]
[{"$f":"'Org structure'!A8","v":"Vote 7 - HUMAN RESOURCES"},null,{"$f":"SUM(C73:C82)","v":0},0,0,0,0,0,0,"",0]
[{"$f":"'Org structure'!E69","v":"7.1 - Administration"},null,null,null,null,null,{"$f":"F73","v":0},{"$f":"D73/12*8","v":0},0,"",{"$f":"G73*12/8","v":0}]
[{"$f":"'Org structure'!E70","v":"7.2 - Training"},null,null,null,null,null,0,{"$f":"D74/12*8","v":0},0,"",{"$f":"G74*12/8","v":0}]
[{"$f":"'Org structure'!E71","v":"7.3 - Health and Safety"},null,null,null,null,null,0,{"$f":"D75/12*8","v":0},0,"",{"$f":"G75*12/8","v":0}]
[{"$f":"'Org structure'!E72","v":0},null,null,null,null,null,null,null,0,""]
[{"$f":"'Org structure'!E73","v":0},null,null,null,null,null,null,null,0,""]
[{"$f":"'Org structure'!E74","v":0},null,null,null,null,null,null,null,0,""]
[{"$f":"'Org structure'!E75","v":0},null,null,null,null,null,null,null,0,""]
[{"$f":"'Org structure'!E76","v":0},null,null,null,null,null,null,null,0,""]
[{"$f":"'Org structure'!E77","v":0},null,null,null,null,null,null,null,0,""]
[{"$f":"'Org structure'!E78","v":0},null,null,null,null,null,null,null,0,""]
[{"$f":"'Org structure'!A9","v":"Vote 8 - COMMUNITY SERVICES"},null,{"$f":"SUM(C84:C93)","v":0},{"$f":"SUM(D84:D93)","v":115159607},0,7484000,56840000,76773071.333333328,-19933071.333333328,-0.25963623686211429,85260000]
[{"$f":"'Org structure'!E80","v":"8.1 - Community Services Admin"},null,null,null,null,null,{"$f":"F84","v":0},{"$f":"D84/12*8","v":0},0,"",{"$f":"G84*12/8","v":0}]
[{"$f":"'Org structure'!E81","v":"8.2 - Parks and Recreation"},null,null,null,null,null,0,{"$f":"D85/12*8","v":0},0,"",{"$f":"G85*12/8","v":0}]
[{"$f":"'Org structure'!E82","v":"8.3 - Refuse"},null,null,115159607,null,7484000,{"$f":"F86+5603000+7514000+7516000+7600000+7485000+6147000+7491000","v":56840000},{"$f":"D86/12*8","v":76773071.333333328},-19933071.333333328,-0.25963623686211429,{"$f":"G86*12/8","v":85260000}]
[{"$f":"'Org structure'!E83","v":"8.4 - Enviromental Protection"},null,null,null,null,null,0,{"$f":"D87/12*8","v":0},0,"",{"$f":"G87*12/8","v":0}]
[{"$f":"'Org structure'!E84","v":0},null,null,null,null,null,null,null,0,""]
[{"$f":"'Org structure'!E85","v":0},null,null,null,null,null,null,null,0,""]
[{"$f":"'Org structure'!E86","v":0},null,null,null,null,null,null,null,0,""]
[{"$f":"'Org structure'!E87","v":0},null,null,null,null,null,null,null,0,""]
[{"$f":"'Org structure'!E88","v":0},null,null,null,null,null,null,null,0,""]
[{"$f":"'Org structure'!E89","v":0},null,null,null,null,null,null,null,0,""]
[{"$f":"'Org structure'!A10","v":"Vote 9 - PUBLIC SAFETY AND TRANSPORT"},null,{"$f":"SUM(C95:C104)","v":0},{"$f":"SUM(D95:D104)","v":4744531},0,219000,1747000,3163020.6666666665,-1416020.6666666665,-0.44767986551252376,2620500]
[{"$f":"'Org structure'!E91","v":"9.1 - Traffic"},null,null,4744531,null,219000,{"$f":"F95+183000+270000+208000+259000+174000+211000+223000","v":1747000},{"$f":"D95/12*8","v":3163020.6666666665},-1416020.6666666665,-0.44767986551252376,{"$f":"G95*12/8","v":2620500}]
[{"$f":"'Org structure'!E92","v":"9.2 - Disaster Management"},null,null,null,null,null,{"$f":"F96","v":0},{"$f":"D96/12*8","v":0},0,"",{"$f":"G96*12/8","v":0}]
[{"$f":"'Org structure'!E93","v":"9.3 - Security"},null,null,null,null,null,0,{"$f":"D97/12*8","v":0},0,"",{"$f":"G97*12/8","v":0}]
[{"$f":"'Org structure'!E94","v":"9.4 - Fire Services"},null,null,null,null,null,0,{"$f":"D98/12*8","v":0},0,"",{"$f":"G98*12/8","v":0}]
[{"$f":"'Org structure'!E95","v":0},null,null,null,null,null,null,null,0,""]
[{"$f":"'Org structure'!E96","v":0},null,null,null,null,null,null,null,0,""]
[{"$f":"'Org structure'!E97","v":0},null,null,null,null,null,null,null,0,""]
[{"$f":"'Org structure'!E98","v":0},null,null,null,null,null,null,null,0,""]
[{"$f":"'Org structure'!E99","v":0},null,null,null,null,null,null,null,0,""]
[{"$f":"'Org structure'!E100","v":0},null,null,null,null,null,null,null,0,""]
[{"$f":"'Org structure'!A11","v":"Vote 10 - ECONOMIC DEVELOPMENT"},null,{"$f":"SUM(C106:C115)","v":0},{"$f":"SUM(D106:D115)","v":14643021},0,0,0,9762014,-9762014,-1,0]
[{"$f":"'Org structure'!E102","v":"10.1 - Economic Development"},null,null,14643021,null,null,{"$f":"F106","v":0},{"$f":"D106/12*8","v":9762014},-9762014,-1,{"$f":"G106*12/8","v":0}]
[{"$f":"'Org structure'!E103","v":0},null,null,null,null,null,null,null,0,""]
[{"$f":"'Org structure'!E104","v":0},null,null,null,null,null,null,null,0,""]
[{"$f":"'Org structure'!E105","v":0},null,null,null,null,null,null,null,0,""]
[{"$f":"'Org structure'!E106","v":0},null,null,null,null,null,null,null,0,""]
[{"$f":"'Org structure'!E107","v":0},null,null,null,null,null,null,null,0,""]
[{"$f":"'Org structure'!E108","v":0},null,null,null,null,null,null,null,0,""]
[{"$f":"'Org structure'!E109","v":0},null,null,null,null,null,null,null,0,""]
[{"$f":"'Org structure'!E110","v":0},null,null,null,null,null,null,null,0,""]
[{"$f":"'Org structure'!E111","v":0},null,null,null,null,null,null,null,0,""]
[{"$f":"'Org structure'!A12","v":"Vote 11 - ENGINEERING SERVICES"},null,{"$f":"SUM(C117:C126)","v":0},{"$f":"SUM(D117:D126)","v":17108115},0,0,0,11405410,-11405410,-1,0]
[{"$f":"'Org structure'!E113","v":"11.1 - Building"},null,null,null,null,null,{"$f":"F117","v":0},{"$f":"D117/12*8","v":0},0,"",{"$f":"G117*12/8","v":0}]
[{"$f":"'Org structure'!E114","v":"11.2 - Engineering Administration"},null,null,null,null,null,0,0,0,"",0]
[{"$f":"'Org structure'!E115","v":"11.3 - Engineering Planning"},null,null,null,null,null,0,0,0,"",0]
[{"$f":"'Org structure'!E116","v":"11.4 - Engineering Surveying"},null,null,null,null,null,0,0,0,"",0]
[{"$f":"'Org structure'!E117","v":"11.5 - Eng- Intern Serv Building Shop"},null,null,null,null,null,0,0,0,"",0]
[{"$f":"'Org structure'!E118","v":"11.6 - Roads"},null,null,17108115,null,null,0,11405410,-11405410,-1,0]
[{"$f":"'Org structure'!E119","v":"11.7 - Storm Water"},null,null,null,null,null,0,0,0,"",0]
[{"$f":"'Org structure'!E120","v":"11.8 - Eng - Roads/ Storm Water"},null,null,null,null,null,0,0,0,"",0]
[{"$f":"'Org structure'!E121","v":0},null,null,null,null,null,null,null,0,""]
[{"$f":"'Org structure'!E122","v":0},null,null,null,null,null,null,null,0,""]
[{"$f":"'Org structure'!A13","v":"Vote 12 - WATER"},null,{"$f":"SUM(C128:C137)","v":0},{"$f":"SUM(D128:D137)","v":355552684},0,42170000,327682000,237035122.66666666,90646877.333333343,0.38241960226631289,491523000]
[{"$f":"'Org structure'!E124","v":"12.1 - Eng-Admin: Water and Sewerage"},null,null,null,null,null,{"$f":"F128","v":0},{"$f":"D128/12*8","v":0},0,"",{"$f":"G128*12/8","v":0}]
[{"$f":"'Org structure'!E125","v":"12.2 - Eng-Admin: Water Supply"},null,null,203889265,null,30062000,{"$f":"F129+21132000+25843000+26392000+31727000+35010000+32117000+32784000","v":235067000},{"$f":"D129/12*8","v":135926176.66666666},99140823.333333343,0.72937255916833099,{"$f":"G129*12/8","v":352600500}]
[{"$f":"'Org structure'!E126","v":"12.3 - Water Workshop"},null,null,null,null,null,0,{"$f":"D130/12*8","v":0},0,"",{"$f":"G130*12/8","v":0}]
[{"$f":"'Org structure'!E127","v":"12.4 - Sewerage Network"},null,null,151663419,null,12108000,{"$f":"F131+9227000+12218000+12219000+12305000+12221000+10211000+12106000","v":92615000},{"$f":"D131/12*8","v":101108946},-8493946,-8.4007858216621115E-2,{"$f":"G131*12/8","v":138922500}]
[{"$f":"'Org structure'!E128","v":"12.5 - Purifying Works"},null,null,null,null,null,0,{"$f":"D132/12*8","v":0},0,"",{"$f":"G132*12/8","v":0}]
[{"$f":"'Org structure'!E129","v":0},null,null,null,null,null,null,null,0,""]
[{"$f":"'Org structure'!E130","v":0},null,null,null,null,null,null,null,{"$f":"G134-H134","v":0},{"$f":"IF(I134=0,\"\",I134/H134)","v":""}]
[{"$f":"'Org structure'!E131","v":0},null,null,null,null,null,null,null,0,""]
[{"$f":"'Org structure'!E132","v":0},null,null,null,null,null,null,null,0,""]
[{"$f":"'Org structure'!E133","v":0},null,null,null,null,null,null,null,0,""]
[{"$f":"'Org structure'!A14","v":"Vote 13 - ELECTRICITY"},null,{"$f":"SUM(C139:C148)","v":0},{"$f":"SUM(D139:D148)","v":748264548},0,40039000,341397000,498843032,-157446032,-0.31562239401992892,512095500]
[{"$f":"'Org structure'!E135","v":"13.1 - Elec and Mec Eng Admin"},null,null,null,null,null,{"$f":"F139","v":0},{"$f":"D139/12*8","v":0},0,"",{"$f":"G139*12/8","v":0}]
[{"$f":"'Org structure'!E136","v":"13.2 - Distribution"},null,null,748264548,null,40039000,{"$f":"F140+34381000+64900000+53084000+31869000+42325000+37166000+37633000","v":341397000},498843032,-157446032,-0.31562239401992892,512095500]
[{"$f":"'Org structure'!E137","v":"13.3 - Distribution 132kVA"},null,null,null,null,null,0,0,0,"",0]
[{"$f":"'Org structure'!E138","v":"13.4 - Streetlights"},null,null,null,null,null,0,0,0,"",0]
[{"$f":"'Org structure'!E139","v":"13.5 - Electrical Workshop"},null,null,null,null,null,0,0,0,"",0]
[{"$f":"'Org structure'!E140","v":"13.6 - Revenue Protection"},null,null,null,null,null,0,0,0,"",0]
[{"$f":"'Org structure'!E141","v":"13.7 - Eng - Plant"},null,null,null,null,null,0,0,0,"",0]
[{"$f":"'Org structure'!E142","v":0},null,null,null,null,null,null,null,0,""]
[{"$f":"'Org structure'!E143","v":0},null,null,null,null,null,null,null,0,""]
[{"$f":"'Org structure'!E144","v":0},null,null,null,null,null,null,null,0,""]
[{"$f":"'Org structure'!A15","v":"Vote 14 - MECHANICAL WORKSHOP"},null,{"$f":"SUM(C150:C159)","v":0},{"$f":"SUM(D150:D159)","v":0},0,0,0,0,0,"",0]
[{"$f":"'Org structure'!E146","v":"14.1 - Mechanical workshop"},null,null,null,null,null,{"$f":"F150","v":0},{"$f":"D150/12*8","v":0},0,"",{"$f":"G150*12/8","v":0}]
[{"$f":"'Org structure'!E147","v":0},null,null,null,null,null,null,null,0,""]
[{"$f":"'Org structure'!E148","v":0},null,null,null,null,null,null,null,0,""]
[{"$f":"'Org structure'!E149","v":0},null,null,null,null,null,null,null,0,""]
[{"$f":"'Org structure'!E150","v":0},null,null,null,null,null,null,null,0,""]
[{"$f":"'Org structure'!E151","v":0},null,null,null,null,null,null,null,0,""]
[{"$f":"'Org structure'!E152","v":0},null,null,null,null,null,null,null,0,""]
[{"$f":"'Org structure'!E153","v":0},null,null,null,null,null,null,null,0,""]
[{"$f":"'Org structure'!E154","v":0},null,null,null,null,null,null,null,0,""]
[{"$f":"'Org structure'!E155","v":0},null,null,null,null,null,null,null,0,""]
[{"$f":"'Org structure'!A16","v":"Vote 15 - HOUSING SERVICES"},null,{"$f":"SUM(C161:C170)","v":0},{"$f":"SUM(D161:D170)","v":10759086},0,1181000,12044000,7172724,4871276,0.67913891570343432,18066000]
[{"$f":"'Org structure'!E157","v":"15.1 - Housing services"},null,null,10759086,null,1181000,{"$f":"F161+3000+1238000+2873000+2369000+1079000+1637000+1664000","v":12044000},{"$f":"D161/12*8","v":7172724},4871276,0.67913891570343432,{"$f":"G161*12/8","v":18066000}]
[{"$f":"'Org structure'!E158","v":0},null,null,null,null,null,null,null,0,""]
[{"$f":"'Org structure'!E159","v":0},null,null,null,null,null,null,null,0,""]
[{"$f":"'Org structure'!E160","v":0},null,null,null,null,null,null,null,0,""]
[{"$f":"'Org structure'!E161","v":0},null,null,null,null,null,null,null,0,""]
[{"$f":"'Org structure'!E162","v":0},null,null,null,null,null,null,null,0,""]
[{"$f":"'Org structure'!E163","v":0},null,null,null,null,null,null,null,0,""]
[{"$f":"'Org structure'!E164","v":0},null,null,null,null,null,null,null,0,""]
[{"$f":"'Org structure'!E165","v":0},null,null,null,null,null,null,null,0,""]
[{"$f":"'Org structure'!E166","v":0},null,null,null,null,null,null,null,0,"",null,{"$f":"SUM(L78:L81)","v":0},0,0,0,0,0,0,0,0,0,0,0]
["Total Revenue by Vote",2,{"$f":"C6+C17+C28+C39+C50+C61+C72+C83+C94+C105+C116+C127+C138+C149+C160","v":0},{"$f":"D6+D17+D28+D39+D50+D61+D72+D83+D94+D105+D116+D127+D138+D149+D160","v":2069171135},0,133925000,1422242000,1379447423.3333333,42794576.666666746,3.1022984959627384E-2,2133363000]
[null,null,null,null,null,null,null,null,0,""]
["Expenditure by Vote",1,null,null,null,null,null,null,0,""]
[{"$f":"'Org structure'!A2","v":"Vote 1 - COUNCIL GENERAL"},null,{"$f":"SUM(C175:C184)","v":0},61938606,0,11645863,61733863,41292404,20441459,0.49504163041706167,92600794.5]
[{"$f":"'Org structure'!E3","v":"1.1 - Council"},null,null,61938606,null,{"$f":"14169073-F185-F196","v":11645863},{"$f":"F175+1056000+4756000+3695000+9623000+13038000+8827000+9093000","v":61733863},{"$f":"D175/12*8","v":41292404},20441459,0.49504163041706167,{"$f":"G175*12/8","v":92600794.5}]
[{"$f":"'Org structure'!E4","v":0},null,null,null,null,null,null,null,0,""]
[{"$f":"'Org structure'!E5","v":0},null,null,null,null,null,null,null,0,""]
[{"$f":"'Org structure'!E6","v":0},null,null,null,null,null,null,null,0,""]
[{"$f":"'Org structure'!E7","v":0},null,null,null,null,null,null,null,0,""]
[{"$f":"'Org structure'!E8","v":0},null,null,null,null,null,null,null,0,""]
[{"$f":"'Org structure'!E9","v":0},null,null,null,null,null,null,null,0,""]
[{"$f":"'Org structure'!E10","v":0},null,null,null,null,null,null,null,0,""]
[{"$f":"'Org structure'!E11","v":0},null,null,null,null,null,null,null,0,""]
[{"$f":"'Org structure'!E12","v":0},null,null,null,null,null,null,null,0,""]
[{"$f":"'Org structure'!A3","v":"Vote 2 - OFFICE OF THE EXECUTIVE MAYOR"},null,{"$f":"SUM(C186:C195)","v":0},{"$f":"SUM(D186:D195)","v":20142109},{"$f":"SUM(E186:E195)","v":0},709939,7304939,13428072.666666668,-6123133.6666666679,-0.45599497550132417,10957408.5]
[{"$f":"'Org structure'!E14","v":"2.1 - Executive Mayor"},null,null,10052158,null,{"$f":"18547+681000","v":699547},{"$f":"F186+696000+1007000+760000+697000+812000+122000","v":4793547},{"$f":"D186/12*8","v":6701438.666666667},-1907891.666666667,-0.28469881790556817,{"$f":"G186*12/8","v":7190320.5}]
[{"$f":"'Org structure'!E15","v":"2.2 - Mayoral Committee"},null,null,10089951,null,{"$f":"10392","v":10392},{"$f":"F187+572000-907000+2042000+8000+12000+774000","v":2511392},{"$f":"D187/12*8","v":6726634},-4215242,-0.62664952485894132,{"$f":"G187*12/8","v":3767088}]
[{"$f":"'Org structure'!E16","v":0},null,null,null,null,null,null,null,0,""]
[{"$f":"'Org structure'!E17","v":0},null,null,null,null,null,null,null,0,""]
[{"$f":"'Org structure'!E18","v":0},null,null,null,null,null,null,null,0,""]
[{"$f":"'Org structure'!E19","v":0},null,null,null,null,null,null,null,0,""]
[{"$f":"'Org structure'!E20","v":0},null,null,null,null,null,null,null,0,""]
[{"$f":"'Org structure'!E21","v":0},null,null,null,null,null,null,null,0,""]
[{"$f":"'Org structure'!E22","v":0},null,null,null,null,null,null,null,0,""]
[{"$f":"'Org structure'!E23","v":0},null,null,null,null,null,null,null,0,""]
[{"$f":"'Org structure'!A4","v":"Vote 3 - OFFICE OF THE SPEAKER"},null,{"$f":"SUM(C197:C206)","v":0},23211722,0,1813271,15382271,15474481.333333334,-92210.333333333954,-5.9588642324770614E-3,23073406.5]
[{"$f":"'Org structure'!E25","v":"3.1 - Speaker"},null,null,23211722,null,{"$f":"1447+183000","v":184447},{"$f":"F197+178000+185000+1372000+281000+235000+275000","v":2710447},{"$f":"D197/12*8","v":15474481.333333334},-12764034.333333334,-0.82484408093462436,{"$f":"G197*12/8","v":4065670.5}]
[{"$f":"'Org structure'!E26","v":"3.2 - Political Appointments"},null,null,null,null,{"$f":"17824+1611000","v":1628824},{"$f":"F198+2956000+1473000+1772000+1588000+1700000+1554000","v":12671824},{"$f":"D198/12*8","v":0},{"$f":"G198-H198","v":12671824},{"$f":"IF(I198=0,\"\",I198/H198)","v":{"$error":"#DIV/0!"}},{"$f":"G198*12/8","v":19007736}]
[{"$f":"'Org structure'!E27","v":0},null,null,null,null,null,null,null,0,""]
[{"$f":"'Org structure'!E28","v":0},null,null,null,null,null,null,null,0,""]
[{"$f":"'Org structure'!E29","v":0},null,null,null,null,null,null,null,0,""]
[{"$f":"'Org structure'!E30","v":0},null,null,null,null,null,null,null,0,""]
[{"$f":"'Org structure'!E31","v":0},null,null,null,null,null,null,null,0,""]
[{"$f":"'Org structure'!E32","v":0},null,null,null,null,null,null,null,0,""]
[{"$f":"'Org structure'!E33","v":0},null,null,null,null,null,null,null,0,""]
[{"$f":"'Org structure'!E34","v":0},null,null,null,null,null,null,null,0,""]
[{"$f":"'Org structure'!A5","v":"Vote 4 - OFFICE OF THE MUNICIPAL MANAGER"},null,{"$f":"SUM(C208:C217)","v":0},61837678,0,5284000,39120000,41225118.666666664,-2105118.6666666642,-5.1063980765901275E-2,58680000]
[{"$f":"'Org structure'!E36","v":"4.1 - Municipal Manager"},null,null,23485165,null,{"$f":"2251000-F209-F210-F211-F213","v":2251000},{"$f":"F208+2520000+657000+1462000+1704000+906000+1012000+1186000","v":11698000},{"$f":"D208/12*8","v":15656776.666666666},-3958776.666666666,-0.25284748904255089,{"$f":"G208*12/8","v":17547000}]
[{"$f":"'Org structure'!E37","v":"4.2 - IDP"},null,null,5416088,null,0,{"$f":"F209+410000+434000+829000+367000+383000+347000+368000","v":3138000},3610725.3333333335,-472725.33333333349,-0.13092254040185466,4707000]
[{"$f":"'Org structure'!E38","v":"4.3 - Internal Audit"},null,null,3642086,null,0,{"$f":"F210+227000+258000+269000+243000+288000+226000+258000","v":1769000},2428057.3333333335,-659057.33333333349,-0.27143400787350991,2653500]
[{"$f":"'Org structure'!E39","v":"4.4 - Organisation & Workstudy"},null,null,390303,null,0,{"$f":"F211+60000","v":60000},260202,-200202,-0.76940991998524222,90000]
[{"$f":"'Org structure'!E40","v":"4.5 - IT"},null,null,24155678,null,3033000,{"$f":"F212+1080000+1037000+533000+560000+1441000+1083000+1615000","v":10382000},16103785.333333334,-5721785.333333334,-0.35530685580425442,15573000]
[{"$f":"'Org structure'!E41","v":"4.6 - Legal Services"},null,null,4748358,null,0,{"$f":"F213+2064000+2156000+939000+1948000+3773000+737000+456000","v":12073000},3165572,8907428,2.8138447016842454,18109500]
[{"$f":"'Org structure'!E42","v":0},null,null,null,null,null,null,null,0,""]
[{"$f":"'Org structure'!E43","v":0},null,null,null,null,null,null,null,0,""]
[{"$f":"'Org structure'!E44","v":0},null,null,null,null,null,null,null,0,""]
[{"$f":"'Org structure'!E45","v":0},null,null,null,null,null,null,null,0,""]
[{"$f":"'Org structure'!A6","v":"Vote 5 - CORPORATE SUPPORT SERVICES"},null,{"$f":"SUM(C219:C228)","v":0},59819711,0,4118000,40359000,39879807.333333336,479192.66666666418,1.2015922310289934E-2,60538500]
[{"$f":"'Org structure'!E47","v":"5.1 - Corporate Services Admin"},null,null,30020077,null,1630000,{"$f":"F219+2455000+2313000+4104000+1934000+1217000+3384000+3641000","v":20678000},{"$f":"D219/12*8","v":20013384.666666668},664615.33333333209,3.3208542403139009E-2,{"$f":"G219*12/8","v":31017000}]
[{"$f":"'Org structure'!E48","v":"5.2 - Libraries"},null,null,16320906,null,1297000,{"$f":"F220+1134000+1272000+1324000+1139000+1295000+1172000+1159000","v":9792000},{"$f":"D220/12*8","v":10880604},-1088604,-0.10004996046175378,{"$f":"G220*12/8","v":14688000}]
[{"$f":"'Org structure'!E49","v":"5.3 - Halls & Offices"},null,null,13478728,null,1191000,{"$f":"F221+920000+1734000+1309000+1015000+1400000+1248000+1072000","v":9889000},{"$f":"D221/12*8","v":8985818.666666666},903181.33333333395,0.10051185838901126,{"$f":"G221*12/8","v":14833500}]
[{"$f":"'Org structure'!E50","v":0},null,null,null,null,null,null,null,0,""]
[{"$f":"'Org structure'!E51","v":0},null,null,null,null,null,null,null,0,""]
[{"$f":"'Org structure'!E52","v":0},null,null,null,null,null,null,null,0,""]
[{"$f":"'Org structure'!E53","v":0},null,null,null,null,null,null,null,0,""]
[{"$f":"'Org structure'!E54","v":0},null,null,null,null,null,null,null,0,""]
[{"$f":"'Org structure'!E55","v":0},null,null,null,null,null,null,null,0,""]
[{"$f":"'Org structure'!E56","v":0},null,null,null,null,null,null,null,0,""]
[{"$f":"'Org structure'!A7","v":"Vote 6 - FINANCE"},null,{"$f":"SUM(C230:C239)","v":0},69268176,0,5142000,65355000,46178784,19176216,0.41526030655116425,98032500]
[{"$f":"'Org structure'!E58","v":"6.1 - Administration"},null,null,9254191,null,{"$f":"4683000-F231-F232-F233-F234-F236-F237","v":4683000},{"$f":"F230+3019000+669000+1308000+623000+842000+539000+622000","v":12305000},{"$f":"D230/12*8","v":6169460.666666667},6135539.333333333,0.99450173440336376,{"$f":"G230*12/8","v":18457500}]
[{"$f":"'Org structure'!E59","v":"6.2 - Expenditure"},null,null,6248378,null,0,{"$f":"F231+324000+7770000+417000+446000+2197000+9426000+324000","v":20904000},4165585.3333333335,16738414.666666666,4.018262339442332,31356000]
[{"$f":"'Org structure'!E60","v":"6.3 - Budget Control & Salaries"},null,null,{"$f":"4086870+6453281","v":10540151},null,0,{"$f":"F232+468000+546000+596000+522000+685000+558000+531000","v":3906000},7026767.333333333,-3120767.333333333,-0.44412561072417273,5859000]
[{"$f":"'Org structure'!E61","v":"6.4 - Stores"},null,null,9810414,null,0,{"$f":"F233+405000+435000+500000+761000+861000+825000+822000","v":4609000},6540276,-1931276,-0.29528967890651708,6913500]
[{"$f":"'Org structure'!E62","v":"6.6 - Revenue"},null,null,26275504,null,0,{"$f":"F234+1948000+2104000+2385000+1952000+2282000+2075000+2162000","v":14908000},17517002.666666668,-2609002.6666666679,-0.14894115827426191,22362000]
[{"$f":"'Org structure'!E63","v":"6.7 - Fresh Produce Market"},null,null,5345438,null,459000,{"$f":"F235+250000+613000+484000+425000+494000+402000+1134000","v":4261000},3563625.3333333335,697374.66666666651,0.19569247646310736,6391500]
[{"$f":"'Org structure'!E64","v":"6.8 - Valuation"},null,null,1794100,null,0,{"$f":"F236+14000+1053000+3395000","v":4462000},1196066.6666666667,3265933.333333333,2.7305612842093523,6693000]
[{"$f":"'Org structure'!E65","v":"6.8 - Credit Contol"},null,null,null,null,0,{"$f":"F237","v":0},0,0,"",0]
[{"$f":"'Org structure'!E66","v":0},null,null,null,null,null,null,null,0,""]
[{"$f":"'Org structure'!E67","v":0},null,null,null,null,null,null,null,0,""]
[{"$f":"'Org structure'!A8","v":"Vote 7 - HUMAN RESOURCES"},null,{"$f":"SUM(C241:C250)","v":0},15261743,0,1160000,8669000,10174495.333333334,-1505495.333333334,-0.14796756831772104,13003500]
[{"$f":"'Org structure'!E69","v":"7.1 - Administration"},null,null,9561450,null,{"$f":"1160000-F242-F243","v":1160000},{"$f":"F241+640000+680000+782000+651000+797000+713000+781000","v":6204000},{"$f":"D241/12*8","v":6374300},-170300,-2.6716659084134727E-2,{"$f":"G241*12/8","v":9306000}]
[{"$f":"'Org structure'!E70","v":"7.2 - Training"},null,null,5048777,null,0,{"$f":"F242+300000+351000+459000+352000+366000+310000+327000","v":2465000},{"$f":"D242/12*8","v":3365851.3333333335},-900851.33333333349,-0.26764442160943136,{"$f":"G242*12/8","v":3697500}]
[{"$f":"'Org structure'!E71","v":"7.3 - Health and Safety"},null,null,651516,null,0,{"$f":"F243","v":0},{"$f":"D243/12*8","v":434344},-434344,-1,{"$f":"G243*12/8","v":0}]
[{"$f":"'Org structure'!E72","v":0},null,null,null,null,null,null,null,0,""]
[{"$f":"'Org structure'!E73","v":0},null,null,null,null,null,null,null,0,""]
[{"$f":"'Org structure'!E74","v":0},null,null,null,null,null,null,null,0,""]
[{"$f":"'Org structure'!E75","v":0},null,null,null,null,null,null,null,0,""]
[{"$f":"'Org structure'!E76","v":0},null,null,null,null,null,null,null,0,""]
[{"$f":"'Org structure'!E77","v":0},null,null,null,null,null,null,null,0,""]
[{"$f":"'Org structure'!E78","v":0},null,null,null,null,null,null,null,0,""]
[{"$f":"'Org structure'!A9","v":"Vote 8 - COMMUNITY SERVICES"},null,{"$f":"SUM(C252:C261)","v":0},244913177,0,14693000,111352000,163275451.33333331,-51923451.333333313,-0.318011378375121,167028000]
[{"$f":"'Org structure'!E80","v":"8.1 - Community Services Admin"},null,null,12388232,null,460000,{"$f":"F252+396000+496000+490000+436000+426000+426000+423000","v":3553000},{"$f":"D252/12*8","v":8258821.333333333},-4705821.333333333,-0.56979333289851208,{"$f":"G252*12/8","v":5329500}]
[{"$f":"'Org structure'!E81","v":"8.2 - Parks and Recreation"},null,null,131385165,null,7029000,{"$f":"F253+5834000+7365000+8427000+6850000+7844000+7156000+6999000","v":57504000},{"$f":"D253/12*8","v":87590110},-30086110,-0.34348752387683951,{"$f":"G253*12/8","v":86256000}]
[{"$f":"'Org structure'!E82","v":"8.3 - Refuse"},null,null,101139780,null,6444000,{"$f":"F254+4836000+5892000+6512000+5203000+6981000+5260000+5383000","v":46511000},{"$f":"D254/12*8","v":67426520},-20915520,-0.31019723396669441,{"$f":"G254*12/8","v":69766500}]
[{"$f":"'Org structure'!E83","v":"8.4 - Enviromental Protection"},null,null,null,null,760000,{"$f":"F255+264000+504000+502000+451000+556000+402000+345000","v":3784000},{"$f":"D255/12*8","v":0},3784000,{"$error":"#DIV/0!"},{"$f":"G255*12/8","v":5676000}]
[{"$f":"'Org structure'!E84","v":0},null,null,null,null,null,null,null,0,""]
[{"$f":"'Org structure'!E85","v":0},null,null,null,null,null,null,null,0,""]
[{"$f":"'Org structure'!E86","v":0},null,null,null,null,null,null,null,0,""]
[{"$f":"'Org structure'!E87","v":0},null,null,null,null,null,null,null,0,""]
[{"$f":"'Org structure'!E88","v":0},null,null,null,null,null,null,null,0,""]
[{"$f":"'Org structure'!E89","v":0},null,null,null,null,null,null,null,0,""]
[{"$f":"'Org structure'!A10","v":"Vote 9 - PUBLIC SAFETY AND TRANSPORT"},null,{"$f":"SUM(C263:C272)","v":0},143406592,0,10625000,97423000,95604394.666666672,{"$f":"G262-H262","v":1818605.3333333284},{"$f":"IF(I262=0,\"\",I262/H262)","v":1.9022193903052882E-2},146134500]
[{"$f":"'Org structure'!E91","v":"9.1 - Traffic"},null,null,55671065,null,4721000,{"$f":"F263+4067000+3988000+4832000+4292000+4641000+4267000+4705000","v":35513000},{"$f":"D263/12*8","v":37114043.333333336},-1601043.3333333358,-4.3138477771172579E-2,{"$f":"G263*12/8","v":53269500}]
[{"$f":"'Org structure'!E92","v":"9.2 - Disaster Management"},null,null,1695774,null,0,{"$f":"F264","v":0},{"$f":"D264/12*8","v":1130516},-1130516,-1,{"$f":"G264*12/8","v":0}]
[{"$f":"'Org structure'!E93","v":"9.3 - Security"},null,null,46975269,null,3206000,{"$f":"F265+3058000+2486000+5487000+5709000+5253000+8692000+5637000","v":39528000},{"$f":"D265/12*8","v":31316846},8211154,0.26219607172446419,{"$f":"G265*12/8","v":59292000}]
[{"$f":"'Org structure'!E94","v":"9.4 - Fire Services"},null,null,39064484,null,2698000,{"$f":"F266+3526000+2667000+2720000+2479000+2593000+2546000+3153000","v":22382000},{"$f":"D266/12*8","v":26042989.333333332},-3660989.3333333321,-0.14057485054711072,{"$f":"G266*12/8","v":33573000}]
[{"$f":"'Org structure'!E95","v":0},null,null,null,null,null,null,null,0,""]
[{"$f":"'Org structure'!E96","v":0},null,null,null,null,null,null,null,0,""]
[{"$f":"'Org structure'!E97","v":0},null,null,null,null,null,null,null,0,""]
[{"$f":"'Org structure'!E98","v":0},null,null,null,null,null,null,null,0,""]
[{"$f":"'Org structure'!E99","v":0},null,null,null,null,null,null,null,0,""]
[{"$f":"'Org structure'!E100","v":0},null,null,null,null,null,null,null,0,""]
[{"$f":"'Org structure'!A11","v":"Vote 10 - ECONOMIC DEVELOPMENT"},null,{"$f":"SUM(C274:C283)","v":0},34187490,0,1118000,9567000,22791660,-13224660,-0.58024119348919734,14350500]
[{"$f":"'Org structure'!E102","v":"10.1 - Economic Development"},null,null,34187490,null,1118000,{"$f":"F274+962000+1051000+2102000+963000+992000+1257000+1122000","v":9567000},{"$f":"D274/12*8","v":22791660},-13224660,-0.58024119348919734,{"$f":"G274*12/8","v":14350500}]
[{"$f":"'Org structure'!E103","v":0},null,null,null,null,null,null,null,0,""]
[{"$f":"'Org structure'!E104","v":0},null,null,null,null,null,null,null,0,""]
[{"$f":"'Org structure'!E105","v":0},null,null,null,null,null,null,null,0,""]
[{"$f":"'Org structure'!E106","v":0},null,null,null,null,null,null,null,0,""]
[{"$f":"'Org structure'!E107","v":0},null,null,null,null,null,null,null,0,""]
[{"$f":"'Org structure'!E108","v":0},null,null,null,null,null,null,null,0,""]
[{"$f":"'Org structure'!E109","v":0},null,null,null,null,null,null,null,0,""]
[{"$f":"'Org structure'!E110","v":0},null,null,null,null,null,null,null,0,""]
[{"$f":"'Org structure'!E111","v":0},null,null,null,null,null,null,null,0,""]
[{"$f":"'Org structure'!A12","v":"Vote 11 - ENGINEERING SERVICES"},null,{"$f":"SUM(C285:C294)","v":0},145213848,0,4537000,37411000,96809232,-59398232,-0.613559582829869,56116500]
[{"$f":"'Org structure'!E113","v":"11.1 - Building"},null,null,1163568,null,0,{"$f":"F285+16000+30000+20000+35000+17000+17000","v":135000},{"$f":"D285/12*8","v":775712},-640712,-0.82596633802235886,{"$f":"G285*12/8","v":202500}]
[{"$f":"'Org structure'!E114","v":"11.2 - Engineering Administration"},null,null,11682788,null,{"$f":"2500000-F287-F288-F289-F285","v":2500000},{"$f":"F286+814000+891000+1303000+761000+830000+1003000+720000","v":8822000},7788525.333333333,1033474.666666667,0.13269195674868023,13233000]
[{"$f":"'Org structure'!E115","v":"11.3 - Engineering Planning"},null,null,1845448,null,0,{"$f":"F287+220000+217000+304000+228000+363000+54000+137000","v":1523000},1230298.6666666667,292701.33333333326,0.23791079456045353,2284500]
[{"$f":"'Org structure'!E116","v":"11.4 - Engineering Surveying"},null,null,998879,null,0,{"$f":"F288+421000+437000+534000+445000+468000+514000+475000","v":3294000},665919.33333333337,2628080.6666666665,3.9465450770313515,4941000]
[{"$f":"'Org structure'!E117","v":"11.5 - Eng- Intern Serv Building Shop"},null,null,6946702,null,0,{"$f":"F289+439000+598000+644000+563000+613000+646000+594000","v":4097000},4631134.666666667,-534134.66666666698,-0.11533559378248849,6145500]
[{"$f":"'Org structure'!E118","v":"11.6 - Roads"},null,null,102278797,null,845000,{"$f":"F290+1161000+1354000+1629000+1413000+1467000+1485000+1183000","v":10537000},68185864.666666672,-57648864.666666672,-0.84546650465589657,15805500]
[{"$f":"'Org structure'!E119","v":"11.7 - Storm Water"},null,null,14380667,null,206000,{"$f":"F291+1037000+1048000+1030000+887000+1027000+1170000+975000","v":7380000},9587111.333333334,-2207111.333333334,-0.23021651221045594,11070000]
[{"$f":"'Org structure'!E120","v":"11.8 - Eng - Roads/ Storm Water"},null,null,5916999,null,986000,{"$f":"F292+2000+456000+179000","v":1623000},3944666,-2321666,-0.58855832154103793,2434500]
[{"$f":"'Org structure'!E121","v":0},null,null,null,null,null,null,null,0,"",0]
[{"$f":"'Org structure'!E122","v":0},null,null,null,null,null,null,null,0,""]
[{"$f":"'Org structure'!A13","v":"Vote 12 - WATER"},null,{"$f":"SUM(C296:C305)","v":0},574793591,0,17865000,125849000,383195727.33333331,-257346727.33333331,-0.67158036736008075,188773500]
[{"$f":"'Org structure'!E124","v":"12.1 - Eng-Admin: Water and Sewerage"},null,null,10418128,null,0,{"$f":"F296+1005000+1247000+1390000+1082000+1231000+1186000+1165000","v":8306000},{"$f":"D296/12*8","v":6945418.666666667},1360581.333333333,0.19589623010967033,{"$f":"G296*12/8","v":12459000}]
[{"$f":"'Org structure'!E125","v":"12.2 - Eng-Admin: Water Supply"},null,null,458772119,null,{"$f":"14782000-F298-F296","v":14782000},{"$f":"F297+5486000+10882000+2534000+13208000+2944000+23112000+10715000","v":83663000},{"$f":"D297/12*8","v":305848079.33333331},-222185079.33333331,-0.72645569597048676,{"$f":"G297*12/8","v":125494500}]
[{"$f":"'Org structure'!E126","v":"12.3 - Water Workshop"},null,null,5324547,null,0,{"$f":"F298+444000+438000+374000+432000+472000+541000+428000","v":3129000},{"$f":"D298/12*8","v":3549698},-420698,-0.11851656112717195,{"$f":"G298*12/8","v":4693500}]
[{"$f":"'Org structure'!E127","v":"12.4 - Sewerage Network"},null,null,65119425,null,{"$f":"3083000-F300","v":3083000},{"$f":"F299+851000+1313000+1315000+4766000+1090000+3248000+1770000","v":17436000},{"$f":"D299/12*8","v":43412950},-25976950,-0.59836868952697297,{"$f":"G299*12/8","v":26154000}]
[{"$f":"'Org structure'!E128","v":"12.5 - Purifying Works"},null,null,35159372,null,0,{"$f":"F300+1342000+1803000+1998000+2045000+2095000+1795000+2237000","v":13315000},{"$f":"D300/12*8","v":23439581.333333332},-10124581.333333332,-0.43194377874553613,{"$f":"G300*12/8","v":19972500}]
[{"$f":"'Org structure'!E129","v":0},null,null,null,null,null,null,null,0,""]
[{"$f":"'Org structure'!E130","v":0},null,null,null,null,null,null,null,0,""]
[{"$f":"'Org structure'!E131","v":0},null,null,null,null,null,null,null,0,""]
[{"$f":"'Org structure'!E132","v":0},null,null,null,null,null,null,null,0,""]
[{"$f":"'Org structure'!E133","v":0},null,null,null,null,null,null,null,0,""]
[{"$f":"'Org structure'!A14","v":"Vote 13 - ELECTRICITY"},null,{"$f":"SUM(C307:C316)","v":0},583325321,0,21567000,150259000,388883547.33333331,-238624547.33333331,-0.61361440711400217,225388500]
[{"$f":"'Org structure'!E135","v":"13.1 - Elec and Mec Eng Admin"},null,null,23593875,null,0,{"$f":"F307+375000+662000+556000+443000+595000+464000+428000","v":3523000},{"$f":"D307/12*8","v":15729250},-12206250,-0.7760223786893844,{"$f":"G307*12/8","v":5284500}]
[{"$f":"'Org structure'!E136","v":"13.2 - Distribution"},null,null,516251135,null,{"$f":"21373000-F309-F311-F312-F307","v":21373000},{"$f":"F308+882000+44263000+1169000+3258000+1598000+30151000+28387000","v":131081000},344167423.33333331,-213086423.33333331,-0.61913594630644253,196621500]
[{"$f":"'Org structure'!E137","v":"13.3 - Distribution 132kVA"},null,null,7660890,null,0,{"$f":"F309+207000+229000+283000+226000+231000+257000+175000","v":1608000},5107260,-3499260,-0.68515407478765522,2412000]
[{"$f":"'Org structure'!E138","v":"13.4 - Streetlights"},null,null,10871920,null,194000,{"$f":"F310+22000+456000+432000+188000+123000+261000+207000","v":1883000},7247946.666666667,-5364946.666666667,-0.74020228257750242,2824500]
[{"$f":"'Org structure'!E139","v":"13.5 - Electrical Workshop"},null,null,23048384,null,0,{"$f":"F311+1392000+1687000+1988000+1566000+1636000+1639000+1788000","v":11696000},15365589.333333334,-3669589.333333334,-0.23881865210159639,17544000]
[{"$f":"'Org structure'!E140","v":"13.6 - Revenue Protection"},null,null,1899117,null,0,{"$f":"F312+468000","v":468000},1266078,-798078,-0.63035452792008073,702000]
[{"$f":"'Org structure'!E141","v":"13.7 - Eng - Plant"},null,null,null,null,null,{"$f":"F313","v":0},0,0,"",0]
[{"$f":"'Org structure'!E142","v":0},null,null,null,null,null,null,null,0,""]
[{"$f":"'Org structure'!E143","v":0},null,null,null,null,null,null,null,0,""]
[{"$f":"'Org structure'!E144","v":0},null,null,null,null,null,null,null,0,""]
[{"$f":"'Org structure'!A15","v":"Vote 14 - MECHANICAL WORKSHOP"},null,{"$f":"SUM(C318:C327)","v":0},8335954,0,502000,4862000,5557302.666666667,-695302.66666666698,-0.1251151337927249,7293000]
[{"$f":"'Org structure'!E146","v":"14.1 - Mechanical workshop"},null,null,8335954,null,502000,{"$f":"F318+538000+753000+696000+569000+650000+605000+549000","v":4862000},{"$f":"D318/12*8","v":5557302.666666667},-695302.66666666698,-0.1251151337927249,{"$f":"G318*12/8","v":7293000}]
[{"$f":"'Org structure'!E147","v":0},null,null,null,null,null,null,null,0,""]
[{"$f":"'Org structure'!E148","v":0},null,null,null,null,null,null,null,0,""]
[{"$f":"'Org structure'!E149","v":0},null,null,null,null,null,null,null,0,""]
[{"$f":"'Org structure'!E150","v":0},null,null,null,null,null,null,null,0,""]
[{"$f":"'Org structure'!E151","v":0},null,null,null,null,null,null,null,0,""]
[{"$f":"'Org structure'!E152","v":0},null,null,null,null,null,null,null,0,""]
[{"$f":"'Org structure'!E153","v":0},null,null,null,null,null,null,null,0,""]
[{"$f":"'Org structure'!E154","v":0},null,null,null,null,null,null,null,{"$f":"G326-H326","v":0},{"$f":"IF(I326=0,\"\",I326/H326)","v":""}]
[{"$f":"'Org structure'!E155","v":0},null,null,null,null,null,null,null,0,""]
[{"$f":"'Org structure'!A16","v":"Vote 15 - HOUSING SERVICES"},null,{"$f":"SUM(C329:C338)","v":0},23016798,0,1838000,16770000,15344532,1425468,9.289745689213591E-2,25155000]
[{"$f":"'Org structure'!E157","v":"15.1 - Housing services"},null,null,23016798,null,1838000,{"$f":"F329+1070000+5041000+2078000+1642000+1603000+1871000+1627000","v":16770000},{"$f":"D329/12*8","v":15344532},1425468,9.289745689213591E-2,{"$f":"G329*12/8","v":25155000}]
[{"$f":"'Org structure'!E158","v":0},null,null,null,null,null,null,null,0,""]
[{"$f":"'Org structure'!E159","v":0},null,null,null,null,null,null,null,0,""]
[{"$f":"'Org structure'!E160","v":0},null,null,null,null,null,null,null,0,""]
[{"$f":"'Org structure'!E161","v":0},null,null,null,null,null,null,null,0,""]
[{"$f":"'Org structure'!E162","v":0},null,null,null,null,null,null,null,0,""]
[{"$f":"'Org structure'!E163","v":0},null,null,null,null,null,null,null,0,""]
[{"$f":"'Org structure'!E164","v":0},null,null,null,null,null,null,null,0,""]
[{"$f":"'Org structure'!E165","v":0},null,null,null,null,null,null,null,0,""]
[{"$f":"'Org structure'!E166","v":0},null,null,null,null,null,null,null,0,"",null,{"$f":"SUM(L173:L249)","v":0},0,0,0,0,0,0,0,0,0,0,0]
["Total Expenditure by Vote",2,{"$f":"C174+C185+C196+C207+C218+C229+C240+C251+C262++C273+C284+C295+C306+C317+C328","v":0},2068672516,0,102618073,791417073,1379115010.6666665,-587697937.66666651,-0.42614135378206952,{"$f":"K174+K185+K196+K207+K218+K229+K240+K251+K262++K273+K284+K295+K306+K317+K328","v":1187125609.5}]
[null,null,null,null,null,null,null,null,0,"",null,{"$f":"L170-L338","v":0},0,0,0,0,0,0,0,0,0,0,0]
[{"$f":"result","v":"Surplus/ (Deficit) for the year"},2,{"$f":"C171-C339","v":0},498619,0,31306927,630824927,332412.66666674614,630492514.33333325,1896.7162733465307,{"$f":"K171-K339","v":946237390.5}]
[{"$f":"head27a","v":"References"}]
["1. Insert 'Vote'; e.g. Department, if different to standard structure"]
["2. Must reconcile to Financial Performance ('Revenue and Expenditure by Standard Classification' and 'Revenue and Expenditure')"]
["3. Assign share in 'associate' to relevant Vote"]
[]
["check revenue"]
["check expenditure"]

{"sheet":"C4-FinPerf RE","index":11,"n_rows":54,"n_cols":11,"rows_kept":54,"cut":false,"hidden":false,"merged":[[1,0,2,0],[1,1,2,1],[1,3,1,10],[0,0,0,10]]}
[{"$f":"muni& \" - \"&S71B& \" - \"&date","v":"FS184 Matjhabeng - Table C4 Monthly Budget Statement - Financial Performance (revenue and expenditure) - M08 February"}]
[{"$f":"desc","v":"Description"},{"$f":"head27","v":"Ref"},{"$f":"Head1","v":"2014/15"},{"$f":"Head2","v":"Budget Year 2015/16"}]
[null,null,{"$f":"Head5","v":"Audited Outcome"},{"$f":"Head6","v":"Original Budget"},{"$f":"Head7","v":"Adjusted Budget"},{"$f":"Head38","v":"Monthly actual"},{"$f":"Head39","v":"YearTD actual"},{"$f":"Head40","v":"YearTD budget"},{"$f":"Head41","v":"YTD variance"},{"$f":"Head41","v":"YTD variance"},{"$f":"Head8","v":"Full Year Forecast"}]
["R thousands",null,null,null,null,null,null,null,null,"%"]
["Revenue By Source"]
["Property rates",null,null,189178890,null,21196000,{"$f":"F6+27998000+21591000+21000000+21159000+21005000+20613000+21198000","v":175760000},{"$f":"D6/12*8","v":126119260},{"$f":"G6-H6","v":49640740},{"$f":"IF(I6=0,\"\",I6/H6)","v":0.39360157996486816},{"$f":"G6*12/8","v":263640000}]
["Property rates - penalties & collection charges",null,null,null,null,null,{"$f":"F7","v":0},0,0,"",0]
["Service charges - electricity revenue",null,null,746024548,null,40039000,{"$f":"F8+34382000+64900000+53084000+31869000+42325000+37166000+37633000","v":341398000},497349698.66666669,-155951698.66666669,-0.31356548337066253,512097000]
["Service charges - water revenue",null,null,203889265,null,30062000,{"$f":"F9+21132000+25843000+26392000+31727000+35010000+32117000+32784000","v":235067000},135926176.66666666,99140823.333333343,0.72937255916833099,352600500]
["Service charges - sanitation revenue",null,null,120882381,null,12108000,{"$f":"F10+9227000+12218000+12219000+12305000+12221000+10211000+12106000","v":92615000},80588254,12026746,0.14923695952018021,138922500]
["Service charges - refuse revenue",null,null,68027311,null,7484000,{"$f":"F11+5603000+7514000+7516000+7600000+7485000+6147000+7491000","v":56840000},45351540.666666664,11488459.333333336,0.25332015548872722,85260000]
["Service charges - other",null,null,null,null,0,0,0,0,"",0]
["Rental of facilities and equipment",null,null,10759086,null,1181000,{"$f":"F13+3000+1238000+2873000+2369000+1079000+1637000+1664000","v":12044000},7172724,4871276,0.67913891570343432,18066000]
["Interest earned - external investments",null,null,635000,null,264000,{"$f":"F14+308000+136000+135000+128000+162000","v":1133000},423333.33333333331,709666.66666666674,1.6763779527559057,1699500]
["Interest earned - outstanding debtors",null,null,112971000,null,10704000,{"$f":"F15+8338000+7149000+9231000+9777000+9617000+9916000+10401000","v":75133000},75314000,-181000,-2.4032716360835966E-3,112699500]
["Dividends received",null,null,16000,null,0,0,10666.666666666666,-10666.666666666666,-1,0]
["Fines",null,null,4103202,null,209000,{"$f":"F17+178000+260000+203000+257000+169000+207000+218000","v":1701000},2735468,-1034468,-0.37816856201571358,2551500]
["Licences and permits",null,null,39541,null,10000,{"$f":"F18+5000+10000+5000+2000+5000+4000+5000","v":46000},26360.666666666668,19639.333333333332,0.74502415214587381,69000]
["Agency services",null,null,10535024,null,896000,896000,7023349.333333333,-6127349.333333333,-0.87242553979943471,1344000]
["Transfers recognised - operational",null,null,406586000,null,0,{"$f":"F20+170484000+429000+78158000+322000","v":249393000},271057333.33333331,-21664333.333333313,-7.9925280260510628E-2,374089500]
["Other revenue",null,null,79072629,null,9772000,{"$f":"F21+29597000+1603000+2132000+9578000+8236000+27788000+11452000","v":100158000},52715086,47442914,0.89998741536720628,150237000]
["Gains on disposal of PPE",null,null,null,null,null,null,null,0,""]
["Total Revenue (excluding capital transfers and contributions)",null,{"$f":"SUM(C6:C22)","v":0},1952719877,0,133925000,1342184000,1301813251.3333333,40370748.666666746,3.1011167404632365E-2,{"$f":"SUM(K6:K22)","v":2013276000}]
[]
["Expenditure By Type"]
["Employee related costs",null,null,569262676,null,51396000,{"$f":"F26+43127000+45571000+52686000+44548000+49245000+47696000+48688000","v":382957000},{"$f":"D26/12*8","v":379508450.66666669},{"$f":"G26-H26","v":3448549.3333333135},{"$f":"IF(I26=0,\"\",I26/H26)","v":9.0868841715524128E-3},{"$f":"G26*12/8","v":574435500}]
["Remuneration of councillors",null,null,26763326,null,2418000,{"$f":"F27+2274000+2293000+2312000+2302000+2312000+2317000+3186000","v":19414000},17842217.333333332,1571782.6666666679,8.8093460431637016E-2,29121000]
["Debt impairment",null,null,87982527,null,0,{"$f":"F28","v":0},58655018,-58655018,-1,0]
["Depreciation & asset impairment",null,null,192680410,null,0,0,128453606.66666667,-128453606.66666667,-1,0]
["Finance charges",null,null,168000000,null,10157,{"$f":"F30+9128000","v":9138157},112000000,-102861843,-0.91840931250000002,13707235.5]
["Bulk purchases",null,null,617809916,null,27159000,{"$f":"F31+454000+52753000+454000+11015000+1249000+46685000+27733000","v":167502000},411873277.33333331,-244371277.33333331,-0.59331666020070806,251253000]
["Other materials",null,null,146314064,null,2638000,{"$f":"F32+949000+1214000+2459000+6801000+1192000+6483000+2571000","v":24307000},97542709.333333328,-73235709.333333328,-0.75080659368466451,36460500]
["Contracted services",null,null,89089602,null,987000,{"$f":"F33+4019000+1487000+1011000+2315000","v":9819000},59393068,-49574068,-0.83467767652615621,14728500]
["Transfers and grants",null,null,32850000,null,3370000,3370000,21900000,-18530000,-0.84611872146118716,5055000]
["Other expenditure",null,null,137920000,null,14638000,{"$f":"F35+13467000+25947000+20863000+19748000+28188000+33567000+18493000","v":174911000},91946666.666666672,82964333.333333328,0.90230930974477952,262366500]
["Loss on disposal of PPE",null,null,null,null,null,null,null,0,""]
["Total Expenditure",null,{"$f":"SUM(C26:C36)","v":0},{"$f":"SUM(D26:D36)","v":2068672521},{"$f":"SUM(E26:E36)","v":0},102616157,791418157,1379115014,-587696857,-0.4261405691577802,1187127235.5]
[]
["Surplus/(Deficit)",null,{"$f":"C23-C37","v":0},-115952644,0,31308843,550765843,-77301762.666666746,{"$f":"I23-I37","v":628067605.66666675},-8.1248807789152195,{"$f":"K23-K37","v":826148764.5}]
["Transfers recognised - capital",null,null,116450997,null,0,{"$f":"F40+40735000+600000+38724000","v":80059000},{"$f":"D40/12*8","v":77633998},{"$f":"G40-H40","v":2425002},3.123634055275628E-2,{"$f":"G40*12/8","v":120088500}]
["Contributions recognised - capital",null,null,null,null,null,null,null,{"$f":"G41-H41","v":0},""]
["Contributed assets",null,null,null,null,null,null,null,{"$f":"G42-H42","v":0},""]
["Surplus/(Deficit) after capital transfers & contributions",null,{"$f":"C39+SUM(C40:C42)","v":0},498353,0,31308843,630824843,332235.33333325386,null,null,{"$f":"K39+SUM(K40:K42)","v":946237264.5}]
["Taxation",null,null,null,null,null,null,null,{"$f":"G44-H44","v":0},{"$f":"IF(I44=0,\"\",I44/H44)","v":""}]
["Surplus/(Deficit) after taxation",null,{"$f":"C43-C44","v":0},498353,0,31308843,630824843,332235.33333325386,null,null,{"$f":"K43-K44","v":946237264.5}]
["Attributable to minorities"]
["Surplus/(Deficit) attributable to municipality",null,{"$f":"SUM(C45:C46)","v":0},498353,0,31308843,630824843,332235.33333325386,null,null,{"$f":"SUM(K45:K46)","v":946237264.5}]
["Share of surplus/ (deficit) of associate"]
["Surplus/ (Deficit) for the year",null,{"$f":"C47+C48","v":0},498353,0,31308843,630824843,332235.33333325386,null,null,{"$f":"K47+K48","v":946237264.5}]
[{"$f":"head27a","v":"References"}]
["1. Material variances to be explained on Table SC1"]
[]
[]
[{"$f":"A23&\" including capital transfers/contributions etc\"","v":"Total Revenue (excluding capital transfers and contributions) including capital transfers/contributions etc"},null,{"$f":"C23+SUM(C40:C42)","v":0},2069170874,0,133925000,1422243000,1379447249.3333333,null,null,{"$f":"K23+SUM(K40:K42)","v":2133364500}]

{"sheet":"C5-Capex","index":12,"n_rows":86,"n_cols":11,"rows_kept":86,"cut":false,"hidden":false,"merged":[[0,0,0,10],[76,0,76,10],[78,0,78,10],[77,0,77,10],[1,0,2,0],[1,1,2,1]]}
[{"$f":"muni& \" - \"&S71D& \" - \"&date","v":"FS184 Matjhabeng - Table C5 Monthly Budget Statement - Capital Expenditure (municipal vote, standard classification and funding) - M08 February"}]
[{"$f":"Vdesc","v":"Vote Description"},{"$f":"head27","v":"Ref"},{"$f":"Head1","v":"2014/15"},{"$f":"Head2","v":"Budget Year 2015/16"}]
[null,null,{"$f":"Head5","v":"Audited Outcome"},{"$f":"Head6","v":"Original Budget"},{"$f":"Head7","v":"Adjusted Budget"},{"$f":"Head38","v":"Monthly actual"},{"$f":"Head39","v":"YearTD actual"},{"$f":"Head40","v":"YearTD budget"},{"$f":"Head41","v":"YTD variance"},{"$f":"Head41","v":"YTD variance"},{"$f":"Head8","v":"Full Year Forecast"}]
["R thousands",1,null,null,null,null,null,null,null,"%"]
["Multi-Year expenditure appropriation",2]
[{"$f":"'Org structure'!A2","v":"Vote 1 - COUNCIL GENERAL"},null,{"$f":"'C5C'!C7","v":0},{"$f":"'C5C'!D7","v":30000000},{"$f":"'C5C'!E7","v":0},{"$f":"'C5C'!F7","v":898000},{"$f":"'C5C'!G7","v":1156000},{"$f":"'C5C'!H7","v":20000000},{"$f":"G6-H6","v":-18844000},{"$f":"IF(I6=0,\"\",I6/H6)","v":-0.94220000000000004},{"$f":"'C5C'!K7","v":1734000}]
[{"$f":"'Org structure'!A3","v":"Vote 2 - OFFICE OF THE EXECUTIVE MAYOR"},null,{"$f":"'C5C'!C18","v":0},{"$f":"'C5C'!D18","v":0},{"$f":"'C5C'!E18","v":0},{"$f":"'C5C'!F18","v":0},{"$f":"'C5C'!G18","v":0},{"$f":"'C5C'!H18","v":0},{"$f":"G7-H7","v":0},{"$f":"IF(I7=0,\"\",I7/H7)","v":""},{"$f":"'C5C'!K18","v":0}]
[{"$f":"'Org structure'!A4","v":"Vote 3 - OFFICE OF THE SPEAKER"},null,{"$f":"'C5C'!C29","v":0},{"$f":"'C5C'!D29","v":0},{"$f":"'C5C'!E29","v":0},{"$f":"'C5C'!F29","v":0},{"$f":"'C5C'!G29","v":0},{"$f":"'C5C'!H29","v":0},{"$f":"G8-H8","v":0},{"$f":"IF(I8=0,\"\",I8/H8)","v":""},{"$f":"'C5C'!K29","v":0}]
[{"$f":"'Org structure'!A5","v":"Vote 4 - OFFICE OF THE MUNICIPAL MANAGER"},null,{"$f":"'C5C'!C40","v":0},{"$f":"'C5C'!D40","v":3944739},{"$f":"'C5C'!E40","v":0},{"$f":"'C5C'!F40","v":0},{"$f":"'C5C'!G40","v":0},{"$f":"'C5C'!H40","v":2629826},-2629826,-1,{"$f":"'C5C'!K40","v":0}]
[{"$f":"'Org structure'!A6","v":"Vote 5 - CORPORATE SUPPORT SERVICES"},null,{"$f":"'C5C'!C51","v":0},{"$f":"'C5C'!D51","v":0},{"$f":"'C5C'!E51","v":0},{"$f":"'C5C'!F51","v":0},{"$f":"'C5C'!G51","v":0},{"$f":"'C5C'!H51","v":0},0,"",{"$f":"'C5C'!K51","v":0}]
[{"$f":"'Org structure'!A7","v":"Vote 6 - FINANCE"},null,{"$f":"'C5C'!C62","v":0},{"$f":"'C5C'!D62","v":0},{"$f":"'C5C'!E62","v":0},{"$f":"'C5C'!F62","v":0},{"$f":"'C5C'!G62","v":0},{"$f":"'C5C'!H62","v":0},0,"",{"$f":"'C5C'!K62","v":0}]
[{"$f":"'Org structure'!A8","v":"Vote 7 - HUMAN RESOURCES"},null,{"$f":"'C5C'!C73","v":0},{"$f":"'C5C'!D73","v":0},{"$f":"'C5C'!E73","v":0},{"$f":"'C5C'!F73","v":0},{"$f":"'C5C'!G73","v":0},{"$f":"'C5C'!H73","v":0},0,"",{"$f":"'C5C'!K73","v":0}]
[{"$f":"'Org structure'!A9","v":"Vote 8 - COMMUNITY SERVICES"},null,{"$f":"'C5C'!C84","v":0},{"$f":"'C5C'!D84","v":47132296},{"$f":"'C5C'!E84","v":0},{"$f":"'C5C'!F84","v":1595000},{"$f":"'C5C'!G84","v":6501000},{"$f":"'C5C'!H84","v":31421530.666666668},-24920530.666666668,-0.79310365020197615,{"$f":"'C5C'!K84","v":9751500}]
[{"$f":"'Org structure'!A10","v":"Vote 9 - PUBLIC SAFETY AND TRANSPORT"},null,{"$f":"'C5C'!C95","v":0},{"$f":"'C5C'!D95","v":601788},{"$f":"'C5C'!E95","v":0},{"$f":"'C5C'!F95","v":0},{"$f":"'C5C'!G95","v":0},{"$f":"'C5C'!H95","v":401192},-401192,-1,{"$f":"'C5C'!K95","v":0}]
[{"$f":"'Org structure'!A11","v":"Vote 10 - ECONOMIC DEVELOPMENT"},null,{"$f":"'C5C'!C106","v":0},{"$f":"'C5C'!D106","v":14643021},{"$f":"'C5C'!E106","v":0},{"$f":"'C5C'!F106","v":2304000},{"$f":"'C5C'!G106","v":10588000},{"$f":"'C5C'!H106","v":9762014},825986,8.4612253168249912E-2,{"$f":"'C5C'!K106","v":15882000}]
[{"$f":"'Org structure'!A12","v":"Vote 11 - ENGINEERING SERVICES"},null,{"$f":"'C5C'!C117","v":0},{"$f":"'C5C'!D117","v":17108115},{"$f":"'C5C'!E117","v":0},{"$f":"'C5C'!F117","v":2418000},{"$f":"'C5C'!G117","v":11080000},{"$f":"'C5C'!H117","v":11405410},-325410,-2.8531197037195505E-2,{"$f":"'C5C'!K117","v":16620000}]
[{"$f":"'Org structure'!A13","v":"Vote 12 - WATER"},null,{"$f":"'C5C'!C128","v":0},{"$f":"'C5C'!D128","v":30781038},{"$f":"'C5C'!E128","v":0},{"$f":"'C5C'!F128","v":1317000},{"$f":"'C5C'!G128","v":16273000},{"$f":"'C5C'!H128","v":20520692},-4247692,-0.20699555356125418,{"$f":"'C5C'!K128","v":24409500}]
[{"$f":"'Org structure'!A14","v":"Vote 13 - ELECTRICITY"},null,{"$f":"'C5C'!C139","v":0},{"$f":"'C5C'!D139","v":2240000},{"$f":"'C5C'!E139","v":0},{"$f":"'C5C'!F139","v":0},{"$f":"'C5C'!G139","v":673000},{"$f":"'C5C'!H139","v":1493333.3333333333},{"$f":"G18-H18","v":-820333.33333333326},{"$f":"IF(I18=0,\"\",I18/H18)","v":-0.54933035714285716},{"$f":"'C5C'!K139","v":1009500}]
[{"$f":"'Org structure'!A15","v":"Vote 14 - MECHANICAL WORKSHOP"},null,{"$f":"'C5C'!C150","v":0},{"$f":"'C5C'!D150","v":0},{"$f":"'C5C'!E150","v":0},{"$f":"'C5C'!F150","v":0},{"$f":"'C5C'!G150","v":0},{"$f":"'C5C'!H150","v":0},{"$f":"G19-H19","v":0},{"$f":"IF(I19=0,\"\",I19/H19)","v":""},{"$f":"'C5C'!K150","v":0}]
[{"$f":"'Org structure'!A16","v":"Vote 15 - HOUSING SERVICES"},null,{"$f":"'C5C'!C161","v":0},{"$f":"'C5C'!D161","v":0},{"$f":"'C5C'!E161","v":0},{"$f":"'C5C'!F161","v":0},{"$f":"'C5C'!G161","v":0},{"$f":"'C5C'!H161","v":0},{"$f":"G20-H20","v":0},{"$f":"IF(I20=0,\"\",I20/H20)","v":""},{"$f":"'C5C'!K161","v":0}]
["Total Capital Multi-year expenditure","4,7",{"$f":"SUM(C6:C20)","v":0},{"$f":"SUM(D6:D20)","v":146450997},0,8532000,46271000,97633998,-51362998.000000007,{"$f":"IF(I21=0,\"\",I21/H21)","v":-0.52607697167128209},{"$f":"SUM(K6:K20)","v":69406500}]
[]
["Single Year expenditure appropriation",2]
[{"$f":"'Org structure'!A2","v":"Vote 1 - COUNCIL GENERAL"},null,{"$f":"'C5C'!C176","v":0},{"$f":"'C5C'!D176","v":0},{"$f":"'C5C'!E176","v":0},{"$f":"'C5C'!F176","v":0},{"$f":"'C5C'!G176","v":0},{"$f":"'C5C'!H176","v":0},{"$f":"'C5C'!I176","v":0},{"$f":"IF(I24=0,\"\",I24/H24)","v":""},{"$f":"'C5C'!K176","v":0}]
[{"$f":"'Org structure'!A3","v":"Vote 2 - OFFICE OF THE EXECUTIVE MAYOR"},null,{"$f":"'C5C'!C187","v":0},{"$f":"'C5C'!D187","v":0},{"$f":"'C5C'!E187","v":0},{"$f":"'C5C'!F187","v":0},{"$f":"'C5C'!G187","v":0},{"$f":"'C5C'!H187","v":0},{"$f":"'C5C'!I187","v":0},{"$f":"IF(I25=0,\"\",I25/H25)","v":""},{"$f":"'C5C'!K187","v":0}]
[{"$f":"'Org structure'!A4","v":"Vote 3 - OFFICE OF THE SPEAKER"},null,{"$f":"'C5C'!C198","v":0},{"$f":"'C5C'!D198","v":0},{"$f":"'C5C'!E198","v":0},{"$f":"'C5C'!F198","v":0},{"$f":"'C5C'!G198","v":0},{"$f":"'C5C'!H198","v":0},{"$f":"'C5C'!I198","v":0},"",{"$f":"'C5C'!K198","v":0}]
[{"$f":"'Org structure'!A5","v":"Vote 4 - OFFICE OF THE MUNICIPAL MANAGER"},null,{"$f":"'C5C'!C209","v":0},{"$f":"'C5C'!D209","v":0},{"$f":"'C5C'!E209","v":0},{"$f":"'C5C'!F209","v":0},{"$f":"'C5C'!G209","v":0},{"$f":"'C5C'!H209","v":0},{"$f":"'C5C'!I209","v":0},"",{"$f":"'C5C'!K209","v":0}]
[{"$f":"'Org structure'!A6","v":"Vote 5 - CORPORATE SUPPORT SERVICES"},null,{"$f":"'C5C'!C220","v":0},{"$f":"'C5C'!D220","v":0},{"$f":"'C5C'!E220","v":0},{"$f":"'C5C'!F220","v":0},{"$f":"'C5C'!G220","v":0},{"$f":"'C5C'!H220","v":0},{"$f":"'C5C'!I220","v":0},"",{"$f":"'C5C'!K220","v":0}]
[{"$f":"'Org structure'!A7","v":"Vote 6 - FINANCE"},null,{"$f":"'C5C'!C231","v":0},{"$f":"'C5C'!D231","v":0},{"$f":"'C5C'!E231","v":0},{"$f":"'C5C'!F231","v":0},{"$f":"'C5C'!G231","v":0},{"$f":"'C5C'!H231","v":0},{"$f":"'C5C'!I231","v":0},"",{"$f":"'C5C'!K231","v":0}]
[{"$f":"'Org structure'!A8","v":"Vote 7 - HUMAN RESOURCES"},null,{"$f":"'C5C'!C242","v":0},{"$f":"'C5C'!D242","v":0},{"$f":"'C5C'!E242","v":0},{"$f":"'C5C'!F242","v":0},{"$f":"'C5C'!G242","v":0},{"$f":"'C5C'!H242","v":0},{"$f":"'C5C'!I242","v":0},"",{"$f":"'C5C'!K242","v":0}]
[{"$f":"'Org structure'!A9","v":"Vote 8 - COMMUNITY SERVICES"},null,{"$f":"'C5C'!C253","v":0},{"$f":"'C5C'!D253","v":0},{"$f":"'C5C'!E253","v":0},{"$f":"'C5C'!F253","v":0},{"$f":"'C5C'!G253","v":0},{"$f":"'C5C'!H253","v":0},{"$f":"'C5C'!I253","v":0},"",{"$f":"'C5C'!K253","v":0}]
[{"$f":"'Org structure'!A10","v":"Vote 9 - PUBLIC SAFETY AND TRANSPORT"},null,{"$f":"'C5C'!C264","v":0},{"$f":"'C5C'!D264","v":0},{"$f":"'C5C'!E264","v":0},{"$f":"'C5C'!F264","v":0},{"$f":"'C5C'!G264","v":0},{"$f":"'C5C'!H264","v":0},{"$f":"'C5C'!I264","v":0},"",{"$f":"'C5C'!K264","v":0}]
[{"$f":"'Org structure'!A11","v":"Vote 10 - ECONOMIC DEVELOPMENT"},null,{"$f":"'C5C'!C275","v":0},{"$f":"'C5C'!D275","v":0},{"$f":"'C5C'!E275","v":0},{"$f":"'C5C'!F275","v":0},{"$f":"'C5C'!G275","v":0},{"$f":"'C5C'!H275","v":0},{"$f":"'C5C'!I275","v":0},"",{"$f":"'C5C'!K275","v":0}]
[{"$f":"'Org structure'!A12","v":"Vote 11 - ENGINEERING SERVICES"},null,{"$f":"'C5C'!C286","v":0},{"$f":"'C5C'!D286","v":0},{"$f":"'C5C'!E286","v":0},{"$f":"'C5C'!F286","v":0},{"$f":"'C5C'!G286","v":0},{"$f":"'C5C'!H286","v":0},{"$f":"'C5C'!I286","v":0},"",{"$f":"'C5C'!K286","v":0}]
[{"$f":"'Org structure'!A13","v":"Vote 12 - WATER"},null,{"$f":"'C5C'!C297","v":0},{"$f":"'C5C'!D297","v":0},{"$f":"'C5C'!E297","v":0},{"$f":"'C5C'!F297","v":0},{"$f":"'C5C'!G297","v":0},{"$f":"'C5C'!H297","v":0},{"$f":"'C5C'!I297","v":0},"",{"$f":"'C5C'!K297","v":0}]
[{"$f":"'Org structure'!A14","v":"Vote 13 - ELECTRICITY"},null,{"$f":"'C5C'!C308","v":0},{"$f":"'C5C'!D308","v":0},{"$f":"'C5C'!E308","v":0},{"$f":"'C5C'!F308","v":0},{"$f":"'C5C'!G308","v":0},{"$f":"'C5C'!H308","v":0},{"$f":"'C5C'!I308","v":0},"",{"$f":"'C5C'!K308","v":0}]
[{"$f":"'Org structure'!A15","v":"Vote 14 - MECHANICAL WORKSHOP"},null,{"$f":"'C5C'!C319","v":0},{"$f":"'C5C'!D319","v":0},{"$f":"'C5C'!E319","v":0},{"$f":"'C5C'!F319","v":0},{"$f":"'C5C'!G319","v":0},{"$f":"'C5C'!H319","v":0},{"$f":"'C5C'!I319","v":0},"",{"$f":"'C5C'!K319","v":0}]
[{"$f":"'Org structure'!A16","v":"Vote 15 - HOUSING SERVICES"},null,{"$f":"'C5C'!C330","v":0},{"$f":"'C5C'!D330","v":0},{"$f":"'C5C'!E330","v":0},{"$f":"'C5C'!F330","v":0},{"$f":"'C5C'!G330","v":0},{"$f":"'C5C'!H330","v":0},{"$f":"'C5C'!I330","v":0},"",{"$f":"'C5C'!K330","v":0}]
["Total Capital single-year expenditure",4,{"$f":"SUM(C24:C38)","v":0},0,0,0,0,0,0,"",{"$f":"SUM(K24:K38)","v":0}]
["Total Capital Expenditure",null,{"$f":"C39+C21","v":0},146450997,0,8532000,46271000,97633998,-51362998.000000007,{"$f":"IF(I40=0,\"\",I40/H40)","v":-0.52607697167128209},{"$f":"K39+K21","v":69406500}]
[]
["Capital Expenditure - Standard Classification"]
[{"$f":"'C2-FinPerf SC'!A29","v":"Governance and administration"},null,{"$f":"SUM(C44:C46)","v":0},33944739,0,898000,1156000,22629826,{"$f":"G43-H43","v":-21473826},{"$f":"IF(I43=0,\"\",I43/H43)","v":-0.94891697355516569},{"$f":"SUM(K44:K46)","v":1734000}]
[{"$f":"'C2-FinPerf SC'!A30","v":"Executive and council"},null,null,{"$f":"'C5C'!D8+'C5C'!D40","v":33944739},null,{"$f":"'C5C'!F8+'C5C'!F40","v":898000},{"$f":"'C5C'!G8+'C5C'!G40","v":1156000},{"$f":"D44/12*8","v":22629826},-21473826,{"$f":"IF(I44=0,\"\",I44/H44)","v":-0.94891697355516569},{"$f":"G44*12/8","v":1734000}]
[{"$f":"'C2-FinPerf SC'!A31","v":"Budget and treasury office"},null,null,null,null,null,null,null,0,""]
[{"$f":"'C2-FinPerf SC'!A32","v":"Corporate services"},null,null,null,null,null,null,null,0,""]
[{"$f":"'C2-FinPerf SC'!A33","v":"Community and public safety"},null,{"$f":"SUM(C48:C52)","v":0},47734084,0,1595000,6501000,31822722.666666668,-25321722.666666668,-0.79571201156808624,{"$f":"SUM(K48:K52)","v":9751500}]
[{"$f":"'C2-FinPerf SC'!A34","v":"Community and social services"},null,null,{"$f":"'C5C'!D85","v":0},null,{"$f":"'C5C'!F85","v":1526000},{"$f":"'C5C'!G85","v":2068000},{"$f":"D48/12*8","v":0},2068000,{"$error":"#DIV/0!"},{"$f":"G48*12/8","v":3102000}]
[{"$f":"'C2-FinPerf SC'!A35","v":"Sport and recreation"},null,null,{"$f":"'C5C'!D86","v":47132296},null,{"$f":"'C5C'!F86","v":69000},{"$f":"'C5C'!G86","v":4433000},{"$f":"D49/12*8","v":31421530.666666668},-26988530.666666668,-0.85891839430016315,{"$f":"G49*12/8","v":6649500}]
[{"$f":"'C2-FinPerf SC'!A36","v":"Public safety"},null,null,{"$f":"'C5C'!D95","v":601788},null,{"$f":"'C5C'!F95","v":0},{"$f":"'C5C'!G95","v":0},{"$f":"D50/12*8","v":401192},-401192,-1,{"$f":"G50*12/8","v":0}]
[{"$f":"'C2-FinPerf SC'!A37","v":"Housing"},null,null,null,null,null,null,null,0,""]
[{"$f":"'C2-FinPerf SC'!A38","v":"Health"},null,null,null,null,null,null,null,0,""]
[{"$f":"'C2-FinPerf SC'!A39","v":"Economic and environmental services"},null,{"$f":"SUM(C54:C56)","v":0},18993919,0,3550000,13956000,12662612.666666666,1293387.333333334,0.10214221720120008,{"$f":"SUM(K54:K56)","v":20934000}]
[{"$f":"'C2-FinPerf SC'!A40","v":"Planning and development"},null,null,{"$f":"'C5C'!D107","v":14643021},null,{"$f":"'C5C'!F107","v":2304000},{"$f":"'C5C'!G107","v":10588000},{"$f":"D54/12*8","v":9762014},825986,8.4612253168249912E-2,{"$f":"G54*12/8","v":15882000}]
[{"$f":"'C2-FinPerf SC'!A41","v":"Road transport"},null,null,{"$f":"'C5C'!D123","v":4350898},null,{"$f":"'C5C'!F123","v":1246000},{"$f":"'C5C'!G123","v":3368000},{"$f":"D55/12*8","v":2900598.6666666665},467401.33333333349,0.16113960842106625,{"$f":"G55*12/8","v":5052000}]
[{"$f":"'C2-FinPerf SC'!A42","v":"Environmental protection"},null,null,null,null,null,null,null,0,""]
[{"$f":"'C2-FinPerf SC'!A43","v":"Trading services"},null,{"$f":"SUM(C58:C61)","v":0},33021038,0,1317000,16946000,22014025.333333332,-5068025.3333333321,-0.23021802040262934,{"$f":"SUM(K58:K61)","v":25419000}]
[{"$f":"'C2-FinPerf SC'!A44","v":"Electricity"},null,null,{"$f":"'C5C'!D139","v":2240000},null,{"$f":"'C5C'!F139","v":0},{"$f":"'C5C'!G139","v":673000},{"$f":"D58/12*8","v":1493333.3333333333},-820333.33333333326,-0.54933035714285716,{"$f":"G58*12/8","v":1009500}]
[{"$f":"'C2-FinPerf SC'!A45","v":"Water"},null,null,{"$f":"'C5C'!D130","v":40000},null,{"$f":"'C5C'!F130","v":0},{"$f":"'C5C'!G130","v":8120000},{"$f":"D59/12*8","v":26666.666666666668},8093333.333333333,303.5,{"$f":"G59*12/8","v":12180000}]
[{"$f":"'C2-FinPerf SC'!A46","v":"Waste water management"},null,null,{"$f":"'C5C'!D132","v":30741038},null,{"$f":"'C5C'!F132","v":1317000},{"$f":"'C5C'!G132","v":8153000},{"$f":"D60/12*8","v":20494025.333333332},-12341025.333333332,-0.60217673846927355,{"$f":"G60*12/8","v":12229500}]
[{"$f":"'C2-FinPerf SC'!A47","v":"Waste management"},null,null,null,null,null,null,{"$f":"D61/12*8","v":0},0,"",{"$f":"G61*12/8","v":0}]
[{"$f":"'C2-FinPerf SC'!A48","v":"Other"},null,null,{"$f":"'C5C'!D124","v":12757217},null,{"$f":"'C5C'!F124","v":1172000},{"$f":"'C5C'!G124","v":7712000},{"$f":"D62/12*8","v":8504811.333333334},-792811.33333333395,-9.3219155870751497E-2,{"$f":"G62*12/8","v":11568000}]
["Total Capital Expenditure - Standard Classification",3,{"$f":"C43+C47+C53+C57+C62","v":0},{"$f":"D43+D47+D53+D57+D62","v":146450997},0,8532000,46271000,97633998,-51362998.000000007,-0.52607697167128209,{"$f":"K43+K47+K53+K57+K62","v":69406500}]
[]
["Funded by:"]
["National Government",null,null,116451000,null,{"$f":"F47+F53+F57+F62","v":7634000},{"$f":"G47+G53+G57+G62","v":45115000},{"$f":"D66/12*8","v":77634000},{"$f":"G66-H66","v":-32519000},{"$f":"IF(I66=0,\"\",I66/H66)","v":-0.41887575031558338},{"$f":"G66*12/8","v":67672500}]
["Provincial Government",null,null,null,null,null,null,null,0,""]
["District Municipality",null,null,null,null,null,null,null,0,""]
["Other transfers and grants",null,null,null,null,null,null,null,0,""]
["Transfers recognised - capital",null,{"$f":"SUM(C66:C69)","v":0},116451000,0,7634000,45115000,77634000,-32519000,-0.41887575031558338,{"$f":"SUM(K66:K69)","v":67672500}]
["Public contributions & donations",5,null,null,null,null,null,null,0,""]
["Borrowing",6,null,null,null,null,null,null,0,""]
["Internally generated funds",null,null,30000000,null,{"$f":"F43","v":898000},{"$f":"G43","v":1156000},{"$f":"D73/12*8","v":20000000},-18844000,-0.94220000000000004,{"$f":"G73*12/8","v":1734000}]
["Total Capital Funding",null,{"$f":"SUM(C70:C73)","v":0},146451000,0,{"$f":"SUM(F70:F73)","v":8532000},{"$f":"SUM(G70:G73)","v":46271000},{"$f":"SUM(H70:H73)","v":97634000},-51363000,-0.52607698137943748,69406500]
[{"$f":"head27a","v":"References"}]
["1. Municipalities may choose to appropriate for capital expenditure for three years or for one year (if one year appropriation projected expenditure required for yr2 and yr3)."]
["2. Include capital component of PPP unitary payment"]
["3. Capital expenditure by standard classification must reconcile to the total of multi-year and single year appropriations"]
["4. Include expenditure on investment property, intangible and biological assets"]
["5. Must reconcile to Monthly Budget Statement Financial Performance (revenue and expenditure)"]
["6. Include finance leases and PPP capital funding component of unitary payment - total borrowing/repayments to reconcile to changes in Table SA17"]
[]
[]
[]
[]
["check balance",null,{"$f":"C40-C74","v":0},{"$f":"D40-D74","v":-3},0,0,0,-2,null,null,0]

{"sheet":"C5C","index":13,"n_rows":345,"n_cols":23,"rows_kept":345,"cut":false,"hidden":false,"merged":[[1,3,1,10],[1,11,1,22],[0,0,0,10]]}
[{"$f":"muni& \" - \"&S71D& \" - \"&\"A\"& \" - \"&date","v":"FS184 Matjhabeng - Table C5 Monthly Budget Statement - Capital Expenditure (municipal vote, standard classification and funding) - A - M08 February"}]
[{"$f":"Vdesc","v":"Vote Description"},{"$f":"head27","v":"Ref"},{"$f":"Head1","v":"2014/15"},{"$f":"Head2","v":"Budget Year 2015/16"},null,null,null,null,null,null,null,{"$f":"Head4","v":{"$error":"#REF!"}}]
["R thousand",null,{"$f":"Head5","v":"Audited Outcome"},{"$f":"Head6","v":"Original Budget"},{"$f":"Head7","v":"Adjusted Budget"},{"$f":"Head38","v":"Monthly actual"},{"$f":"Head39","v":"YearTD actual"},{"$f":"Head40","v":"YearTD budget"},{"$f":"Head41","v":"YTD variance"},{"$f":"Head41","v":"YTD variance"},{"$f":"Head8","v":"Full Year Forecast"},{"$f":"Head12","v":"Forecast 2010/11"},{"$f":"Head13","v":"Forecast 2011/12"},{"$f":"Head14","v":"Forecast 2012/13"},{"$f":"Head15","v":"Forecast 2013/14"},{"$f":"Head16","v":"Forecast 2014/15"},{"$f":"Head17","v":"Forecast 2015/16"},{"$f":"Head18","v":"Forecast 2016/17"},{"$f":"Head19","v":"Forecast 2017/18"},{"$f":"Head20","v":"Forecast 2018/19"},{"$f":"Head21","v":"Forecast 2019/20"},{"$f":"Head22","v":"Forecast 2020/21"},{"$f":"Head23","v":"Forecast 2021/22"}]
[null,null,null,null,null,null,null,null,null,"%"]
["Capital expenditure - Municipal Vote"]
["Expenditure of multi-year capital appropriation",1]
[{"$f":"'Org structure'!A2","v":"Vote 1 - COUNCIL GENERAL"},null,{"$f":"SUM(C8:C17)","v":0},{"$f":"SUM(D8:D17)","v":30000000},0,898000,1156000,20000000,{"$f":"G7-H7","v":-18844000},{"$f":"IF(I7=0,\"\",I7/H7)","v":-0.94220000000000004},1734000]
[{"$f":"'Org structure'!E3","v":"1.1 - Council"},null,null,30000000,null,{"$f":"25000+873000","v":898000},{"$f":"F8+19000+239000","v":1156000},{"$f":"D8/12*8","v":20000000},-18844000,-0.94220000000000004,{"$f":"G8*12/8","v":1734000}]
[{"$f":"'Org structure'!E4","v":0},null,null,null,null,null,null,null,0,""]
[{"$f":"'Org structure'!E5","v":0},null,null,null,null,null,null,null,0,""]
[{"$f":"'Org structure'!E6","v":0},null,null,null,null,null,null,null,0,""]
[{"$f":"'Org structure'!E7","v":0},null,null,null,null,null,null,null,0,""]
[{"$f":"'Org structure'!E8","v":0},null,null,null,null,null,null,null,0,""]
[{"$f":"'Org structure'!E9","v":0},null,null,null,null,null,null,null,0,""]
[{"$f":"'Org structure'!E10","v":0},null,null,null,null,null,null,null,0,""]
[{"$f":"'Org structure'!E11","v":0},null,null,null,null,null,null,null,0,""]
[{"$f":"'Org structure'!E12","v":0},null,null,null,null,null,null,null,0,""]
[{"$f":"'Org structure'!A3","v":"Vote 2 - OFFICE OF THE EXECUTIVE MAYOR"},null,{"$f":"SUM(C19:C28)","v":0},{"$f":"SUM(D19:D28)","v":0},0,0,0,0,0,"",0]
[{"$f":"'Org structure'!E14","v":"2.1 - Executive Mayor"},null,null,null,null,null,null,null,0,""]
[{"$f":"'Org structure'!E15","v":"2.2 - Mayoral Committee"},null,null,null,null,null,null,null,0,""]
[{"$f":"'Org structure'!E16","v":0},null,null,null,null,null,null,null,0,""]
[{"$f":"'Org structure'!E17","v":0},null,null,null,null,null,null,null,0,""]
[{"$f":"'Org structure'!E18","v":0},null,null,null,null,null,null,null,0,""]
[{"$f":"'Org structure'!E19","v":0},null,null,null,null,null,null,null,0,""]
[{"$f":"'Org structure'!E20","v":0},null,null,null,null,null,null,null,0,""]
[{"$f":"'Org structure'!E21","v":0},null,null,null,null,null,null,null,0,""]
[{"$f":"'Org structure'!E22","v":0},null,null,null,null,null,null,null,0,""]
[{"$f":"'Org structure'!E23","v":0},null,null,null,null,null,null,null,0,""]
[{"$f":"'Org structure'!A4","v":"Vote 3 - OFFICE OF THE SPEAKER"},null,{"$f":"SUM(C30:C39)","v":0},0,0,0,0,0,0,"",0]
[{"$f":"'Org structure'!E25","v":"3.1 - Speaker"},null,null,null,null,null,null,null,0,""]
[{"$f":"'Org structure'!E26","v":"3.2 - Political Appointments"},null,null,null,null,null,null,null,0,""]
[{"$f":"'Org structure'!E27","v":0},null,null,null,null,null,null,null,0,""]
[{"$f":"'Org structure'!E28","v":0},null,null,null,null,null,null,null,0,""]
[{"$f":"'Org structure'!E29","v":0},null,null,null,null,null,null,null,0,""]
[{"$f":"'Org structure'!E30","v":0},null,null,null,null,null,null,null,0,""]
[{"$f":"'Org structure'!E31","v":0},null,null,null,null,null,null,null,0,""]
[{"$f":"'Org structure'!E32","v":0},null,null,null,null,null,null,null,0,""]
[{"$f":"'Org structure'!E33","v":0},null,null,null,null,null,null,null,0,""]
[{"$f":"'Org structure'!E34","v":0},null,null,null,null,null,null,null,0,""]
[{"$f":"'Org structure'!A5","v":"Vote 4 - OFFICE OF THE MUNICIPAL MANAGER"},null,{"$f":"SUM(C41:C50)","v":0},3944739,0,0,0,2629826,-2629826,-1,0]
[{"$f":"'Org structure'!E36","v":"4.1 - Municipal Manager"},null,null,3944739,null,null,{"$f":"F41","v":0},{"$f":"D41/12*8","v":2629826},-2629826,-1,{"$f":"G41*12/8","v":0}]
[{"$f":"'Org structure'!E37","v":"4.2 - IDP"},null,null,null,null,null,null,null,0,""]
[{"$f":"'Org structure'!E38","v":"4.3 - Internal Audit"},null,null,null,null,null,null,null,0,""]
[{"$f":"'Org structure'!E39","v":"4.4 - Organisation & Workstudy"},null,null,null,null,null,null,null,0,""]
[{"$f":"'Org structure'!E40","v":"4.5 - IT"},null,null,null,null,null,null,null,0,""]
[{"$f":"'Org structure'!E41","v":"4.6 - Legal Services"},null,null,null,null,null,null,null,0,""]
[{"$f":"'Org structure'!E42","v":0},null,null,null,null,null,null,null,0,""]
[{"$f":"'Org structure'!E43","v":0},null,null,null,null,null,null,null,0,""]
[{"$f":"'Org structure'!E44","v":0},null,null,null,null,null,null,null,0,""]
[{"$f":"'Org structure'!E45","v":0},null,null,null,null,null,null,null,0,""]
[{"$f":"'Org structure'!A6","v":"Vote 5 - CORPORATE SUPPORT SERVICES"},null,{"$f":"SUM(C52:C61)","v":0},{"$f":"SUM(D52:D61)","v":0},0,0,0,0,0,"",0]
[{"$f":"'Org structure'!E47","v":"5.1 - Corporate Services Admin"},null,null,null,null,null,null,null,0,""]
[{"$f":"'Org structure'!E48","v":"5.2 - Libraries"},null,null,null,null,null,null,null,0,""]
[{"$f":"'Org structure'!E49","v":"5.3 - Halls & Offices"},null,null,null,null,null,null,null,0,""]
[{"$f":"'Org structure'!E50","v":0},null,null,null,null,null,null,null,0,""]
[{"$f":"'Org structure'!E51","v":0},null,null,null,null,null,null,null,0,""]
[{"$f":"'Org structure'!E52","v":0},null,null,null,null,null,null,null,0,""]
[{"$f":"'Org structure'!E53","v":0},null,null,null,null,null,null,null,0,""]
[{"$f":"'Org structure'!E54","v":0},null,null,null,null,null,null,null,0,""]
[{"$f":"'Org structure'!E55","v":0},null,null,null,null,null,null,null,0,""]
[{"$f":"'Org structure'!E56","v":0},null,null,null,null,null,null,null,0,""]
[{"$f":"'Org structure'!A7","v":"Vote 6 - FINANCE"},null,{"$f":"SUM(C63:C72)","v":0},{"$f":"SUM(D63:D72)","v":0},0,0,0,0,0,"",0]
[{"$f":"'Org structure'!E58","v":"6.1 - Administration"},null,null,null,null,null,null,null,0,""]
[{"$f":"'Org structure'!E59","v":"6.2 - Expenditure"},null,null,null,null,null,null,null,0,""]
[{"$f":"'Org structure'!E60","v":"6.3 - Budget Control & Salaries"},null,null,null,null,null,null,null,0,""]
[{"$f":"'Org structure'!E61","v":"6.4 - Stores"},null,null,null,null,null,null,null,0,""]
[{"$f":"'Org structure'!E62","v":"6.6 - Revenue"},null,null,null,null,null,null,null,0,""]
[{"$f":"'Org structure'!E63","v":"6.7 - Fresh Produce Market"},null,null,null,null,null,null,null,0,""]
[{"$f":"'Org structure'!E64","v":"6.8 - Valuation"},null,null,null,null,null,null,null,0,""]
[{"$f":"'Org structure'!E65","v":"6.8 - Credit Contol"},null,null,null,null,null,null,null,0,""]
[{"$f":"'Org structure'!E66","v":0},null,null,null,null,null,null,null,{"$f":"G71-H71","v":0},{"$f":"IF(I71=0,\"\",I71/H71)","v":""}]
[{"$f":"'Org structure'!E67","v":0},null,null,null,null,null,null,null,0,""]
[{"$f":"'Org structure'!A8","v":"Vote 7 - HUMAN RESOURCES"},null,{"$f":"SUM(C74:C83)","v":0},0,0,0,0,0,0,"",0]
[{"$f":"'Org structure'!E69","v":"7.1 - Administration"},null,null,null,null,null,null,null,0,""]
[{"$f":"'Org structure'!E70","v":"7.2 - Training"},null,null,null,null,null,null,null,0,""]
[{"$f":"'Org structure'!E71","v":"7.3 - Health and Safety"},null,null,null,null,null,null,null,0,""]
[{"$f":"'Org structure'!E72","v":0},null,null,null,null,null,null,null,0,""]
[{"$f":"'Org structure'!E73","v":0},null,null,null,null,null,null,null,0,""]
[{"$f":"'Org structure'!E74","v":0},null,null,null,null,null,null,null,0,""]
[{"$f":"'Org structure'!E75","v":0},null,null,null,null,null,null,null,0,""]
[{"$f":"'Org structure'!E76","v":0},null,null,null,null,null,null,null,0,""]
[{"$f":"'Org structure'!E77","v":0},null,null,null,null,null,null,null,0,""]
[{"$f":"'Org structure'!E78","v":0},null,null,null,null,null,null,null,0,""]
[{"$f":"'Org structure'!A9","v":"Vote 8 - COMMUNITY SERVICES"},null,{"$f":"SUM(C85:C94)","v":0},{"$f":"SUM(D85:D94)","v":47132296},0,1595000,6501000,31421530.666666668,-24920530.666666668,-0.79310365020197615,9751500]
[{"$f":"'Org structure'!E80","v":"8.1 - Community Services Admin"},null,null,null,null,{"$f":"1526000","v":1526000},{"$f":"F85+542000","v":2068000},{"$f":"D85/12*8","v":0},2068000,{"$error":"#DIV/0!"},{"$f":"G85*12/8","v":3102000}]
[{"$f":"'Org structure'!E81","v":"8.2 - Parks and Recreation"},null,null,47132296,null,69000,{"$f":"F86+381000+155000+1062000+1215000+1551000","v":4433000},31421530.666666668,-26988530.666666668,-0.85891839430016315,6649500]
[{"$f":"'Org structure'!E82","v":"8.3 - Refuse"},null,null,null,null,null,{"$f":"F87","v":0},0,0,"",0]
[{"$f":"'Org structure'!E83","v":"8.4 - Enviromental Protection"},null,null,null,null,null,0,0,0,"",0]
[{"$f":"'Org structure'!E84","v":0},null,null,null,null,null,null,null,0,""]
[{"$f":"'Org structure'!E85","v":0},null,null,null,null,null,null,null,0,""]
[{"$f":"'Org structure'!E86","v":0},null,null,null,null,null,null,null,0,""]
[{"$f":"'Org structure'!E87","v":0},null,null,null,null,null,null,null,0,""]
[{"$f":"'Org structure'!E88","v":0},null,null,null,null,null,null,null,0,""]
[{"$f":"'Org structure'!E89","v":0},null,null,null,null,null,null,null,0,""]
[{"$f":"'Org structure'!A10","v":"Vote 9 - PUBLIC SAFETY AND TRANSPORT"},null,{"$f":"SUM(C96:C105)","v":0},{"$f":"SUM(D96:D105)","v":601788},0,0,0,401192,-401192,-1,0]
[{"$f":"'Org structure'!E91","v":"9.1 - Traffic"},null,null,null,null,null,null,null,0,""]
[{"$f":"'Org structure'!E92","v":"9.2 - Disaster Management"},null,null,null,null,null,null,null,0,""]
[{"$f":"'Org structure'!E93","v":"9.3 - Security"},null,null,null,null,null,null,null,0,""]
[{"$f":"'Org structure'!E94","v":"9.4 - Fire Services"},null,null,601788,null,null,{"$f":"F99","v":0},{"$f":"D99/12*8","v":401192},-401192,-1,{"$f":"G99*12/8","v":0}]
[{"$f":"'Org structure'!E95","v":0},null,null,null,null,null,null,null,0,""]
[{"$f":"'Org structure'!E96","v":0},null,null,null,null,null,null,null,0,""]
[{"$f":"'Org structure'!E97","v":0},null,null,null,null,null,null,null,0,""]
[{"$f":"'Org structure'!E98","v":0},null,null,null,null,null,null,null,0,""]
[{"$f":"'Org structure'!E99","v":0},null,null,null,null,null,null,null,0,""]
[{"$f":"'Org structure'!E100","v":0},null,null,null,null,null,null,null,0,""]
[{"$f":"'Org structure'!A11","v":"Vote 10 - ECONOMIC DEVELOPMENT"},null,{"$f":"SUM(C107:C116)","v":0},{"$f":"SUM(D107:D116)","v":14643021},0,2304000,10588000,9762014,825986,8.4612253168249912E-2,15882000]
[{"$f":"'Org structure'!E102","v":"10.1 - Economic Development"},null,null,14643021,null,{"$f":"377000+114000+358000+1455000","v":2304000},{"$f":"F107+1271000+1983000+151000+400000+1713000+2766000","v":10588000},{"$f":"D107/12*8","v":9762014},825986,8.4612253168249912E-2,{"$f":"G107*12/8","v":15882000}]
[{"$f":"'Org structure'!E103","v":0},null,null,null,null,null,null,null,0,""]
[{"$f":"'Org structure'!E104","v":0},null,null,null,null,null,null,null,0,""]
[{"$f":"'Org structure'!E105","v":0},null,null,null,null,null,null,null,0,""]
[{"$f":"'Org structure'!E106","v":0},null,null,null,null,null,null,null,0,""]
[{"$f":"'Org structure'!E107","v":0},null,null,null,null,null,null,null,0,""]
[{"$f":"'Org structure'!E108","v":0},null,null,null,null,null,null,null,0,""]
[{"$f":"'Org structure'!E109","v":0},null,null,null,null,null,null,null,0,""]
[{"$f":"'Org structure'!E110","v":0},null,null,null,null,null,null,null,0,""]
[{"$f":"'Org structure'!E111","v":0},null,null,null,null,null,null,null,0,""]
[{"$f":"'Org structure'!A12","v":"Vote 11 - ENGINEERING SERVICES"},null,{"$f":"SUM(C118:C127)","v":0},{"$f":"SUM(D118:D127)","v":17108115},0,2418000,11080000,11405410,-325410,-2.8531197037195505E-2,16620000]
[{"$f":"'Org structure'!E113","v":"11.1 - Building"},null,null,null,null,null,null,null,0,""]
[{"$f":"'Org structure'!E114","v":"11.2 - Engineering Administration"},null,null,null,null,null,null,null,0,""]
[{"$f":"'Org structure'!E115","v":"11.3 - Engineering Planning"},null,null,null,null,null,null,null,0,""]
[{"$f":"'Org structure'!E116","v":"11.4 - Engineering Surveying"},null,null,null,null,null,null,null,0,""]
[{"$f":"'Org structure'!E117","v":"11.5 - Eng- Intern Serv Building Shop"},null,null,null,null,null,null,null,0,""]
[{"$f":"'Org structure'!E118","v":"11.6 - Roads"},null,null,4350898,null,1246000,{"$f":"F123+458000+353000+124000+1187000","v":3368000},{"$f":"D123/12*8","v":2900598.6666666665},467401.33333333349,0.16113960842106625,{"$f":"G123*12/8","v":5052000}]
[{"$f":"'Org structure'!E119","v":"11.7 - Storm Water"},null,null,12757217,null,1172000,{"$f":"F124+2749000+1838000+165000+793000+192000+803000","v":7712000},8504811.333333334,-792811.33333333395,-9.3219155870751497E-2,11568000]
[{"$f":"'Org structure'!E120","v":"11.8 - Eng - Roads/ Storm Water"},null,null,null,null,null,{"$f":"F125","v":0},0,0,"",0]
[{"$f":"'Org structure'!E121","v":0},null,null,null,null,null,null,null,0,""]
[{"$f":"'Org structure'!E122","v":0},null,null,null,null,null,null,null,0,""]
[{"$f":"'Org structure'!A13","v":"Vote 12 - WATER"},null,{"$f":"SUM(C129:C138)","v":0},{"$f":"SUM(D129:D138)","v":30781038},0,1317000,16273000,20520692,-4247692,-0.20699555356125418,24409500]
[{"$f":"'Org structure'!E124","v":"12.1 - Eng-Admin: Water and Sewerage"},null,null,null,null,null,{"$f":"F129","v":0},{"$f":"D129/12*8","v":0},0,"",{"$f":"G129*12/8","v":0}]
[{"$f":"'Org structure'!E125","v":"12.2 - Eng-Admin: Water Supply"},null,null,40000,null,0,{"$f":"F130+377000+5993000+1030000+576000+144000","v":8120000},26666.666666666668,8093333.333333333,303.5,12180000]
[{"$f":"'Org structure'!E126","v":"12.3 - Water Workshop"},null,null,null,null,null,0,0,0,"",0]
[{"$f":"'Org structure'!E127","v":"12.4 - Sewerage Network"},null,null,30741038,null,1317000,{"$f":"F132+1191000+573000+611000+1142000+1314000+2005000","v":8153000},20494025.333333332,-12341025.333333332,-0.60217673846927355,12229500]
[{"$f":"'Org structure'!E128","v":"12.5 - Purifying Works"},null,null,null,null,null,0,0,0,"",0]
[{"$f":"'Org structure'!E129","v":0},null,null,null,null,null,null,null,0,""]
[{"$f":"'Org structure'!E130","v":0},null,null,null,null,null,null,null,{"$f":"G135-H135","v":0},{"$f":"IF(I135=0,\"\",I135/H135)","v":""}]
[{"$f":"'Org structure'!E131","v":0},null,null,null,null,null,null,null,0,""]
[{"$f":"'Org structure'!E132","v":0},null,null,null,null,null,null,null,0,""]
[{"$f":"'Org structure'!E133","v":0},null,null,null,null,null,null,null,0,""]
[{"$f":"'Org structure'!A14","v":"Vote 13 - ELECTRICITY"},null,{"$f":"SUM(C140:C149)","v":0},{"$f":"SUM(D140:D149)","v":2240000},0,0,673000,1493333.3333333333,-820333.33333333326,-0.54933035714285716,1009500]
[{"$f":"'Org structure'!E135","v":"13.1 - Elec and Mec Eng Admin"},null,null,null,null,null,{"$f":"F140","v":0},{"$f":"D140/12*8","v":0},0,"",{"$f":"G140*12/8","v":0}]
[{"$f":"'Org structure'!E136","v":"13.2 - Distribution"},null,null,1800000,null,null,0,1200000,-1200000,-1,0]
[{"$f":"'Org structure'!E137","v":"13.3 - Distribution 132kVA"},null,null,null,null,null,0,0,0,"",0]
[{"$f":"'Org structure'!E138","v":"13.4 - Streetlights"},null,null,440000,null,0,{"$f":"F143+673000","v":673000},293333.33333333331,379666.66666666669,1.2943181818181819,1009500]
[{"$f":"'Org structure'!E139","v":"13.5 - Electrical Workshop"},null,null,null,null,null,null,null,0,""]
[{"$f":"'Org structure'!E140","v":"13.6 - Revenue Protection"},null,null,null,null,null,null,null,0,""]
[{"$f":"'Org structure'!E141","v":"13.7 - Eng - Plant"},null,null,null,null,null,null,null,0,""]
[{"$f":"'Org structure'!E142","v":0},null,null,null,null,null,null,null,0,""]
[{"$f":"'Org structure'!E143","v":0},null,null,null,null,null,null,null,0,""]
[{"$f":"'Org structure'!E144","v":0},null,null,null,null,null,null,null,0,""]
[{"$f":"'Org structure'!A15","v":"Vote 14 - MECHANICAL WORKSHOP"},null,{"$f":"SUM(C151:C160)","v":0},{"$f":"SUM(D151:D160)","v":0},0,0,0,0,0,"",0]
[{"$f":"'Org structure'!E146","v":"14.1 - Mechanical workshop"},null,null,null,null,null,null,null,0,""]
[{"$f":"'Org structure'!E147","v":0},null,null,null,null,null,null,null,0,""]
[{"$f":"'Org structure'!E148","v":0},null,null,null,null,null,null,null,0,""]
[{"$f":"'Org structure'!E149","v":0},null,null,null,null,null,null,null,0,""]
[{"$f":"'Org structure'!E150","v":0},null,null,null,null,null,null,null,0,""]
[{"$f":"'Org structure'!E151","v":0},null,null,null,null,null,null,null,0,""]
[{"$f":"'Org structure'!E152","v":0},null,null,null,null,null,null,null,0,""]
[{"$f":"'Org structure'!E153","v":0},null,null,null,null,null,null,null,0,""]
[{"$f":"'Org structure'!E154","v":0},null,null,null,null,null,null,null,0,""]
[{"$f":"'Org structure'!E155","v":0},null,null,null,null,null,null,null,0,""]
[{"$f":"'Org structure'!A16","v":"Vote 15 - HOUSING SERVICES"},null,{"$f":"SUM(C162:C171)","v":0},{"$f":"SUM(D162:D171)","v":0},0,0,0,0,0,"",0]
[{"$f":"'Org structure'!E157","v":"15.1 - Housing services"},null,null,null,null,null,null,null,0,""]
[{"$f":"'Org structure'!E158","v":0},null,null,null,null,null,null,null,0,""]
[{"$f":"'Org structure'!E159","v":0},null,null,null,null,null,null,null,0,""]
[{"$f":"'Org structure'!E160","v":0},null,null,null,null,null,null,null,0,""]
[{"$f":"'Org structure'!E161","v":0},null,null,null,null,null,null,null,0,""]
[{"$f":"'Org structure'!E162","v":0},null,null,null,null,null,null,null,0,""]
[{"$f":"'Org structure'!E163","v":0},null,null,null,null,null,null,null,0,""]
[{"$f":"'Org structure'!E164","v":0},null,null,null,null,null,null,null,0,""]
[{"$f":"'Org structure'!E165","v":0},null,null,null,null,null,null,null,0,""]
[{"$f":"'Org structure'!E166","v":0},null,null,null,null,null,null,null,0,"",null,{"$f":"SUM(L79:L82)","v":0},0,0,0,0,0,0,0,0,0,0,0]
["Total multi-year capital expenditure",null,{"$f":"C7+C18+C29+C40+C51+C62+C73+C84+C95+C106+C117+C128+C139+C150+C161","v":0},{"$f":"D7+D18+D29+D40+D51+D62+D73+D84+D95+D106+D117+D128+D139+D150+D161","v":146450997},0,8532000,46271000,97633998,-51362998,-0.52607697167128198,69406500]
[null,null,null,null,null,null,null,null,0,""]
["Capital expenditure - Municipal Vote"]
["Expenditue of single-year capital appropriation",1,null,null,null,null,null,null,0,""]
[{"$f":"'Org structure'!A2","v":"Vote 1 - COUNCIL GENERAL"},null,{"$f":"SUM(C177:C186)","v":0},0,0,0,0,0,0,"",0]
[{"$f":"'Org structure'!E3","v":"1.1 - Council"},null,null,null,null,null,null,null,0,""]
[{"$f":"'Org structure'!E4","v":0},null,null,null,null,null,null,null,0,""]
[{"$f":"'Org structure'!E5","v":0},null,null,null,null,null,null,null,0,""]
[{"$f":"'Org structure'!E6","v":0},null,null,null,null,null,null,null,0,""]
[{"$f":"'Org structure'!E7","v":0},null,null,null,null,null,null,null,0,""]
[{"$f":"'Org structure'!E8","v":0},null,null,null,null,null,null,null,0,""]
[{"$f":"'Org structure'!E9","v":0},null,null,null,null,null,null,null,0,""]
[{"$f":"'Org structure'!E10","v":0},null,null,null,null,null,null,null,0,""]
[{"$f":"'Org structure'!E11","v":0},null,null,null,null,null,null,null,0,""]
[{"$f":"'Org structure'!E12","v":0},null,null,null,null,null,null,null,0,""]
[{"$f":"'Org structure'!A3","v":"Vote 2 - OFFICE OF THE EXECUTIVE MAYOR"},null,{"$f":"SUM(C188:C197)","v":0},{"$f":"SUM(D188:D197)","v":0},{"$f":"SUM(E188:E197)","v":0},0,0,0,0,"",0]
[{"$f":"'Org structure'!E14","v":"2.1 - Executive Mayor"},null,null,null,null,null,null,null,0,""]
[{"$f":"'Org structure'!E15","v":"2.2 - Mayoral Committee"},null,null,null,null,null,null,null,0,""]
[{"$f":"'Org structure'!E16","v":0},null,null,null,null,null,null,null,0,""]
[{"$f":"'Org structure'!E17","v":0},null,null,null,null,null,null,null,0,""]
[{"$f":"'Org structure'!E18","v":0},null,null,null,null,null,null,null,0,""]
[{"$f":"'Org structure'!E19","v":0},null,null,null,null,null,null,null,0,""]
[{"$f":"'Org structure'!E20","v":0},null,null,null,null,null,null,null,0,""]
[{"$f":"'Org structure'!E21","v":0},null,null,null,null,null,null,null,0,""]
[{"$f":"'Org structure'!E22","v":0},null,null,null,null,null,null,null,0,""]
[{"$f":"'Org structure'!E23","v":0},null,null,null,null,null,null,null,0,""]
[{"$f":"'Org structure'!A4","v":"Vote 3 - OFFICE OF THE SPEAKER"},null,{"$f":"SUM(C199:C208)","v":0},0,0,0,0,0,0,"",0]
[{"$f":"'Org structure'!E25","v":"3.1 - Speaker"},null,null,null,null,null,null,null,0,""]
[{"$f":"'Org structure'!E26","v":"3.2 - Political Appointments"},null,null,null,null,null,null,null,{"$f":"G200-H200","v":0},{"$f":"IF(I200=0,\"\",I200/H200)","v":""}]
[{"$f":"'Org structure'!E27","v":0},null,null,null,null,null,null,null,0,""]
[{"$f":"'Org structure'!E28","v":0},null,null,null,null,null,null,null,0,""]
[{"$f":"'Org structure'!E29","v":0},null,null,null,null,null,null,null,0,""]
[{"$f":"'Org structure'!E30","v":0},null,null,null,null,null,null,null,0,""]
[{"$f":"'Org structure'!E31","v":0},null,null,null,null,null,null,null,0,""]
[{"$f":"'Org structure'!E32","v":0},null,null,null,null,null,null,null,0,""]
[{"$f":"'Org structure'!E33","v":0},null,null,null,null,null,null,null,0,""]
[{"$f":"'Org structure'!E34","v":0},null,null,null,null,null,null,null,0,""]
[{"$f":"'Org structure'!A5","v":"Vote 4 - OFFICE OF THE MUNICIPAL MANAGER"},null,{"$f":"SUM(C210:C219)","v":0},0,0,0,0,0,0,"",0]
[{"$f":"'Org structure'!E36","v":"4.1 - Municipal Manager"},null,null,null,null,null,null,null,0,""]
[{"$f":"'Org structure'!E37","v":"4.2 - IDP"},null,null,null,null,null,null,null,0,""]
[{"$f":"'Org structure'!E38","v":"4.3 - Internal Audit"},null,null,null,null,null,null,null,0,""]
[{"$f":"'Org structure'!E39","v":"4.4 - Organisation & Workstudy"},null,null,null,null,null,null,null,0,""]
[{"$f":"'Org structure'!E40","v":"4.5 - IT"},null,null,null,null,null,null,null,0,""]
[{"$f":"'Org structure'!E41","v":"4.6 - Legal Services"},null,null,null,null,null,null,null,0,""]
[{"$f":"'Org structure'!E42","v":0},null,null,null,null,null,null,null,0,""]
[{"$f":"'Org structure'!E43","v":0},null,null,null,null,null,null,null,0,""]
[{"$f":"'Org structure'!E44","v":0},null,null,null,null,null,null,null,0,""]
[{"$f":"'Org structure'!E45","v":0},null,null,null,null,null,null,null,0,""]
[{"$f":"'Org structure'!A6","v":"Vote 5 - CORPORATE SUPPORT SERVICES"},null,{"$f":"SUM(C221:C230)","v":0},0,0,0,0,0,0,"",0]
[{"$f":"'Org structure'!E47","v":"5.1 - Corporate Services Admin"},null,null,null,null,null,null,null,0,""]
[{"$f":"'Org structure'!E48","v":"5.2 - Libraries"},null,null,null,null,null,null,null,0,""]
[{"$f":"'Org structure'!E49","v":"5.3 - Halls & Offices"},null,null,null,null,null,null,null,0,""]
[{"$f":"'Org structure'!E50","v":0},null,null,null,null,null,null,null,0,""]
[{"$f":"'Org structure'!E51","v":0},null,null,null,null,null,null,null,0,""]
[{"$f":"'Org structure'!E52","v":0},null,null,null,null,null,null,null,0,""]
[{"$f":"'Org structure'!E53","v":0},null,null,null,null,null,null,null,0,""]
[{"$f":"'Org structure'!E54","v":0},null,null,null,null,null,null,null,0,""]
[{"$f":"'Org structure'!E55","v":0},null,null,null,null,null,null,null,0,""]
[{"$f":"'Org structure'!E56","v":0},null,null,null,null,null,null,null,0,""]
[{"$f":"'Org structure'!A7","v":"Vote 6 - FINANCE"},null,{"$f":"SUM(C232:C241)","v":0},0,0,0,0,0,0,"",0]
[{"$f":"'Org structure'!E58","v":"6.1 - Administration"},null,null,null,null,null,null,null,0,""]
[{"$f":"'Org structure'!E59","v":"6.2 - Expenditure"},null,null,null,null,null,null,null,0,""]
[{"$f":"'Org structure'!E60","v":"6.3 - Budget Control & Salaries"},null,null,null,null,null,null,null,0,""]
[{"$f":"'Org structure'!E61","v":"6.4 - Stores"},null,null,null,null,null,null,null,0,""]
[{"$f":"'Org structure'!E62","v":"6.6 - Revenue"},null,null,null,null,null,null,null,0,""]
[{"$f":"'Org structure'!E63","v":"6.7 - Fresh Produce Market"},null,null,null,null,null,null,null,0,""]
[{"$f":"'Org structure'!E64","v":"6.8 - Valuation"},null,null,null,null,null,null,null,0,""]
[{"$f":"'Org structure'!E65","v":"6.8 - Credit Contol"},null,null,null,null,null,null,null,0,""]
[{"$f":"'Org structure'!E66","v":0},null,null,null,null,null,null,null,0,""]
[{"$f":"'Org structure'!E67","v":0},null,null,null,null,null,null,null,0,""]
[{"$f":"'Org structure'!A8","v":"Vote 7 - HUMAN RESOURCES"},null,{"$f":"SUM(C243:C252)","v":0},0,0,0,0,0,0,"",0]
[{"$f":"'Org structure'!E69","v":"7.1 - Administration"},null,null,null,null,null,null,null,0,""]
[{"$f":"'Org structure'!E70","v":"7.2 - Training"},null,null,null,null,null,null,null,0,""]
[{"$f":"'Org structure'!E71","v":"7.3 - Health and Safety"},null,null,null,null,null,null,null,0,""]
[{"$f":"'Org structure'!E72","v":0},null,null,null,null,null,null,null,0,""]
[{"$f":"'Org structure'!E73","v":0},null,null,null,null,null,null,null,0,""]
[{"$f":"'Org structure'!E74","v":0},null,null,null,null,null,null,null,0,""]
[{"$f":"'Org structure'!E75","v":0},null,null,null,null,null,null,null,0,""]
[{"$f":"'Org structure'!E76","v":0},null,null,null,null,null,null,null,0,""]
[{"$f":"'Org structure'!E77","v":0},null,null,null,null,null,null,null,0,""]
[{"$f":"'Org structure'!E78","v":0},null,null,null,null,null,null,null,0,""]
[{"$f":"'Org structure'!A9","v":"Vote 8 - COMMUNITY SERVICES"},null,{"$f":"SUM(C254:C263)","v":0},0,0,0,0,0,0,"",0]
[{"$f":"'Org structure'!E80","v":"8.1 - Community Services Admin"},null,null,null,null,null,null,null,0,""]
[{"$f":"'Org structure'!E81","v":"8.2 - Parks and Recreation"},null,null,null,null,null,null,null,0,""]
[{"$f":"'Org structure'!E82","v":"8.3 - Refuse"},null,null,null,null,null,null,null,0,""]
[{"$f":"'Org structure'!E83","v":"8.4 - Enviromental Protection"},null,null,null,null,null,null,null,0,""]
[{"$f":"'Org structure'!E84","v":0},null,null,null,null,null,null,null,0,""]
[{"$f":"'Org structure'!E85","v":0},null,null,null,null,null,null,null,0,""]
[{"$f":"'Org structure'!E86","v":0},null,null,null,null,null,null,null,0,""]
[{"$f":"'Org structure'!E87","v":0},null,null,null,null,null,null,null,0,""]
[{"$f":"'Org structure'!E88","v":0},null,null,null,null,null,null,null,0,""]
[{"$f":"'Org structure'!E89","v":0},null,null,null,null,null,null,null,0,""]
[{"$f":"'Org structure'!A10","v":"Vote 9 - PUBLIC SAFETY AND TRANSPORT"},null,{"$f":"SUM(C265:C274)","v":0},0,0,0,0,0,{"$f":"G264-H264","v":0},{"$f":"IF(I264=0,\"\",I264/H264)","v":""},0]
[{"$f":"'Org structure'!E91","v":"9.1 - Traffic"},null,null,null,null,null,null,null,0,""]
[{"$f":"'Org structure'!E92","v":"9.2 - Disaster Management"},null,null,null,null,null,null,null,0,""]
[{"$f":"'Org structure'!E93","v":"9.3 - Security"},null,null,null,null,null,null,null,0,""]
[{"$f":"'Org structure'!E94","v":"9.4 - Fire Services"},null,null,null,null,null,null,null,0,""]
[{"$f":"'Org structure'!E95","v":0},null,null,null,null,null,null,null,0,""]
[{"$f":"'Org structure'!E96","v":0},null,null,null,null,null,null,null,0,""]
[{"$f":"'Org structure'!E97","v":0},null,null,null,null,null,null,null,0,""]
[{"$f":"'Org structure'!E98","v":0},null,null,null,null,null,null,null,0,""]
[{"$f":"'Org structure'!E99","v":0},null,null,null,null,null,null,null,0,""]
[{"$f":"'Org structure'!E100","v":0},null,null,null,null,null,null,null,0,""]
[{"$f":"'Org structure'!A11","v":"Vote 10 - ECONOMIC DEVELOPMENT"},null,{"$f":"SUM(C276:C285)","v":0},0,0,0,0,0,0,"",0]
[{"$f":"'Org structure'!E102","v":"10.1 - Economic Development"},null,null,null,null,null,null,null,0,""]
[{"$f":"'Org structure'!E103","v":0},null,null,null,null,null,null,null,0,""]
[{"$f":"'Org structure'!E104","v":0},null,null,null,null,null,null,null,0,""]
[{"$f":"'Org structure'!E105","v":0},null,null,null,null,null,null,null,0,""]
[{"$f":"'Org structure'!E106","v":0},null,null,null,null,null,null,null,0,""]
[{"$f":"'Org structure'!E107","v":0},null,null,null,null,null,null,null,0,""]
[{"$f":"'Org structure'!E108","v":0},null,null,null,null,null,null,null,0,""]
[{"$f":"'Org structure'!E109","v":0},null,null,null,null,null,null,null,0,""]
[{"$f":"'Org structure'!E110","v":0},null,null,null,null,null,null,null,0,""]
[{"$f":"'Org structure'!E111","v":0},null,null,null,null,null,null,null,0,""]
[{"$f":"'Org structure'!A12","v":"Vote 11 - ENGINEERING SERVICES"},null,{"$f":"SUM(C287:C296)","v":0},0,0,0,0,0,0,"",0]
[{"$f":"'Org structure'!E113","v":"11.1 - Building"},null,null,null,null,null,null,null,0,""]
[{"$f":"'Org structure'!E114","v":"11.2 - Engineering Administration"},null,null,null,null,null,null,null,0,""]
[{"$f":"'Org structure'!E115","v":"11.3 - Engineering Planning"},null,null,null,null,null,null,null,0,""]
[{"$f":"'Org structure'!E116","v":"11.4 - Engineering Surveying"},null,null,null,null,null,null,null,0,""]
[{"$f":"'Org structure'!E117","v":"11.5 - Eng- Intern Serv Building Shop"},null,null,null,null,null,null,null,0,""]
[{"$f":"'Org structure'!E118","v":"11.6 - Roads"},null,null,null,null,null,null,null,0,""]
[{"$f":"'Org structure'!E119","v":"11.7 - Storm Water"},null,null,null,null,null,null,null,0,""]
[{"$f":"'Org structure'!E120","v":"11.8 - Eng - Roads/ Storm Water"},null,null,null,null,null,null,null,0,""]
[{"$f":"'Org structure'!E121","v":0},null,null,null,null,null,null,null,0,""]
[{"$f":"'Org structure'!E122","v":0},null,null,null,null,null,null,null,0,""]
[{"$f":"'Org structure'!A13","v":"Vote 12 - WATER"},null,{"$f":"SUM(C298:C307)","v":0},0,0,0,0,0,0,"",0]
[{"$f":"'Org structure'!E124","v":"12.1 - Eng-Admin: Water and Sewerage"},null,null,null,null,null,null,null,0,""]
[{"$f":"'Org structure'!E125","v":"12.2 - Eng-Admin: Water Supply"},null,null,null,null,null,null,null,0,""]
[{"$f":"'Org structure'!E126","v":"12.3 - Water Workshop"},null,null,null,null,null,null,null,0,""]
[{"$f":"'Org structure'!E127","v":"12.4 - Sewerage Network"},null,null,null,null,null,null,null,0,""]
[{"$f":"'Org structure'!E128","v":"12.5 - Purifying Works"},null,null,null,null,null,null,null,0,""]
[{"$f":"'Org structure'!E129","v":0},null,null,null,null,null,null,null,0,""]
[{"$f":"'Org structure'!E130","v":0},null,null,null,null,null,null,null,0,""]
[{"$f":"'Org structure'!E131","v":0},null,null,null,null,null,null,null,0,""]
[{"$f":"'Org structure'!E132","v":0},null,null,null,null,null,null,null,0,""]
[{"$f":"'Org structure'!E133","v":0},null,null,null,null,null,null,null,0,""]
[{"$f":"'Org structure'!A14","v":"Vote 13 - ELECTRICITY"},null,{"$f":"SUM(C309:C318)","v":0},0,0,0,0,0,0,"",0]
[{"$f":"'Org structure'!E135","v":"13.1 - Elec and Mec Eng Admin"},null,null,null,null,null,null,null,0,""]
[{"$f":"'Org structure'!E136","v":"13.2 - Distribution"},null,null,null,null,null,null,null,0,""]
[{"$f":"'Org structure'!E137","v":"13.3 - Distribution 132kVA"},null,null,null,null,null,null,null,0,""]
[{"$f":"'Org structure'!E138","v":"13.4 - Streetlights"},null,null,null,null,null,null,null,0,""]
[{"$f":"'Org structure'!E139","v":"13.5 - Electrical Workshop"},null,null,null,null,null,null,null,0,""]
[{"$f":"'Org structure'!E140","v":"13.6 - Revenue Protection"},null,null,null,null,null,null,null,0,""]
[{"$f":"'Org structure'!E141","v":"13.7 - Eng - Plant"},null,null,null,null,null,null,null,0,""]
[{"$f":"'Org structure'!E142","v":0},null,null,null,null,null,null,null,0,""]
[{"$f":"'Org structure'!E143","v":0},null,null,null,null,null,null,null,0,""]
[{"$f":"'Org structure'!E144","v":0},null,null,null,null,null,null,null,0,""]
[{"$f":"'Org structure'!A15","v":"Vote 14 - MECHANICAL WORKSHOP"},null,{"$f":"SUM(C320:C329)","v":0},0,0,0,0,0,0,"",0]
[{"$f":"'Org structure'!E146","v":"14.1 - Mechanical workshop"},null,null,null,null,null,null,null,0,""]
[{"$f":"'Org structure'!E147","v":0},null,null,null,null,null,null,null,0,""]
[{"$f":"'Org structure'!E148","v":0},null,null,null,null,null,null,null,0,""]
[{"$f":"'Org structure'!E149","v":0},null,null,null,null,null,null,null,0,""]
[{"$f":"'Org structure'!E150","v":0},null,null,null,null,null,null,null,0,""]
[{"$f":"'Org structure'!E151","v":0},null,null,null,null,null,null,null,0,""]
[{"$f":"'Org structure'!E152","v":0},null,null,null,null,null,null,null,0,""]
[{"$f":"'Org structure'!E153","v":0},null,null,null,null,null,null,null,0,""]
[{"$f":"'Org structure'!E154","v":0},null,null,null,null,null,null,null,{"$f":"G328-H328","v":0},{"$f":"IF(I328=0,\"\",I328/H328)","v":""}]
[{"$f":"'Org structure'!E155","v":0},null,null,null,null,null,null,null,0,""]
[{"$f":"'Org structure'!A16","v":"Vote 15 - HOUSING SERVICES"},null,{"$f":"SUM(C331:C340)","v":0},0,0,0,0,0,0,"",0]
[{"$f":"'Org structure'!E157","v":"15.1 - Housing services"},null,null,null,null,null,null,null,0,""]
[{"$f":"'Org structure'!E158","v":0},null,null,null,null,null,null,null,0,""]
[{"$f":"'Org structure'!E159","v":0},null,null,null,null,null,null,null,0,""]
[{"$f":"'Org structure'!E160","v":0},null,null,null,null,null,null,null,0,""]
[{"$f":"'Org structure'!E161","v":0},null,null,null,null,null,null,null,0,""]
[{"$f":"'Org structure'!E162","v":0},null,null,null,null,null,null,null,0,""]
[{"$f":"'Org structure'!E163","v":0},null,null,null,null,null,null,null,0,""]
[{"$f":"'Org structure'!E164","v":0},null,null,null,null,null,null,null,0,""]
[{"$f":"'Org structure'!E165","v":0},null,null,null,null,null,null,null,0,""]
[{"$f":"'Org structure'!E166","v":0},null,null,null,null,null,null,null,0,"",null,{"$f":"SUM(L175:L251)","v":0},0,0,0,0,0,0,0,0,0,0,0]
["Total single-year capital expenditure",null,{"$f":"C176+C187+C198+C209+C220+C231+C242+C253+C264+C286+C297+C308+C319+C330+C275","v":0},{"$f":"D176+D187+D198+D209+D220+D231+D242+D253+D264+D286+D297+D308+D319+D330+D275","v":0},0,0,0,0,0,"",0]
[null,null,null,null,null,null,null,null,0,"",null,{"$f":"L171-L340","v":0},0,0,0,0,0,0,0,0,0,0,0]
["Total Capital Expenditure",null,{"$f":"C172+C341","v":0},{"$f":"D172+D341","v":146450997},0,8532000,46271000,97633998,-51362998,-0.52607697167128198,69406500]
[{"$f":"head27a","v":"References"}]
["1. Insert 'Vote'; e.g. Department, if different to standard structure"]

{"sheet":"C6-FinPos","index":14,"n_rows":54,"n_cols":7,"rows_kept":54,"cut":false,"hidden":false,"merged":[[1,0,2,0],[1,1,2,1],[49,0,49,6],[0,0,0,6]]}
[{"$f":"muni& \" - \"&S71E& \" - \"&date","v":"FS184 Matjhabeng - Table C6 Monthly Budget Statement - Financial Position - M08 February"}]
[{"$f":"desc","v":"Description"},{"$f":"head27","v":"Ref"},{"$f":"Head1","v":"2014/15"},{"$f":"Head2","v":"Budget Year 2015/16"}]
[null,null,{"$f":"Head5","v":"Audited Outcome"},{"$f":"Head6","v":"Original Budget"},{"$f":"Head7","v":"Adjusted Budget"},{"$f":"Head39","v":"YearTD actual"},{"$f":"Head8","v":"Full Year Forecast"}]
["R thousands",1]
["ASSETS"]
["Current assets"]
["Cash",null,null,5000000,null,-30539000,{"$f":"F7*12/8","v":-45808500}]
["Call investment deposits",null,null,13624000,null,null,{"$f":"F8*12/8","v":0}]
["Consumer debtors",null,null,1912017473,null,243938000,365907000]
["Other debtors",null,null,10000000,null,-1736000,-2604000]
["Current portion of long-term receivables",null,null,null,null,null,0]
["Inventory",null,null,346477184,null,null,0]
["Total current assets",null,{"$f":"SUM(C7:C12)","v":0},{"$f":"SUM(D7:D12)","v":2287118657},{"$f":"SUM(E7:E12)","v":0},{"$f":"SUM(F7:F12)","v":211663000},{"$f":"SUM(G7:G12)","v":317494500}]
[]
["Non current assets"]
["Long-term receivables"]
["Investments",null,null,15777435,null,26000000,{"$f":"F17*12/8","v":39000000}]
["Investment property",null,null,460000000,null,null,0]
["Investments in Associate"]
["Property, plant and equipment",null,null,5000000000,null,null,{"$f":"F20*12/8","v":0}]
["Agricultural"]
["Biological assets"]
["Intangible assets"]
["Other non-current assets",null,null,5000000,null,null,{"$f":"F24*12/8","v":0}]
["Total non current assets",null,{"$f":"SUM(C16:C24)","v":0},{"$f":"SUM(D16:D24)","v":5480777435},{"$f":"SUM(E16:E24)","v":0},{"$f":"SUM(F16:F24)","v":26000000},{"$f":"SUM(G16:G24)","v":39000000}]
["TOTAL ASSETS",null,{"$f":"C13+C25","v":0},{"$f":"D13+D25","v":7767896092},{"$f":"E13+E25","v":0},{"$f":"F13+F25","v":237663000},{"$f":"G13+G25","v":356494500}]
[]
["LIABILITIES"]
["Current liabilities"]
["Bank overdraft"]
["Borrowing",null,null,null,null,null,{"$f":"F31*12/8","v":0}]
["Consumer deposits",null,null,33000000,null,-86000,-129000]
["Trade and other payables",null,null,1450000000,null,-17718000,-26577000]
["Provisions",null,null,null,null,null,0]
["Total current liabilities",null,{"$f":"SUM(C30:C34)","v":0},{"$f":"SUM(D30:D34)","v":1483000000},{"$f":"SUM(E30:E34)","v":0},{"$f":"SUM(F30:F34)","v":-17804000},{"$f":"SUM(G30:G34)","v":-26706000}]
[]
["Non current liabilities"]
["Borrowing"]
["Provisions",null,null,318000000,null,null,{"$f":"F39*12/8","v":0}]
["Total non current liabilities",null,{"$f":"SUM(C38:C39)","v":0},{"$f":"SUM(D38:D39)","v":318000000},{"$f":"SUM(E38:E39)","v":0},{"$f":"SUM(F38:F39)","v":0},{"$f":"SUM(G38:G39)","v":0}]
["TOTAL LIABILITIES",null,{"$f":"C35+C40","v":0},{"$f":"D35+D40","v":1801000000},{"$f":"E35+E40","v":0},{"$f":"F35+F40","v":-17804000},{"$f":"G35+G40","v":-26706000}]
[]
["NET ASSETS",2,{"$f":"C26-C41","v":0},{"$f":"D26-D41","v":5966896092},{"$f":"E26-E41","v":0},{"$f":"F26-F41","v":255467000},{"$f":"G26-G41","v":383200500}]
[]
["COMMUNITY WEALTH/EQUITY"]
["Accumulated Surplus/(Deficit)",null,null,5966896092,null,null,{"$f":"F46*12/8","v":0}]
["Reserves",null,null,null,null,255467000,383200500]
["TOTAL COMMUNITY WEALTH/EQUITY",2,{"$f":"SUM(C46:C47)","v":0},{"$f":"SUM(D46:D47)","v":5966896092},{"$f":"SUM(E46:E47)","v":0},{"$f":"SUM(F46:F47)","v":255467000},{"$f":"SUM(G46:G47)","v":383200500}]
[{"$f":"head27a","v":"References"}]
["1. Material variances to be explained in Table SC1"]
["2. Net assets must balance with Total Community Wealth/Equity"]
[]
[]
["check balance",null,{"$f":"C43-C48","v":0},{"$f":"D43-D48","v":0},{"$f":"E43-E48","v":0},{"$f":"F43-F48","v":0},{"$f":"G43-G48","v":0}]

{"sheet":"C7-CFlow","index":15,"n_rows":43,"n_cols":11,"rows_kept":43,"cut":false,"hidden":false,"merged":[[1,0,2,0],[1,1,2,1],[0,0,0,10]]}
[{"$f":"muni& \" - \"&S71F& \" - \"&date","v":"FS184 Matjhabeng - Table C7 Monthly Budget Statement - Cash Flow  - M08 February"}]
[{"$f":"desc","v":"Description"},{"$f":"head27","v":"Ref"},{"$f":"Head1","v":"2014/15"},{"$f":"Head2","v":"Budget Year 2015/16"}]
[null,null,{"$f":"Head5","v":"Audited Outcome"},{"$f":"Head6","v":"Original Budget"},{"$f":"Head7","v":"Adjusted Budget"},{"$f":"Head38","v":"Monthly actual"},{"$f":"Head39","v":"YearTD actual"},{"$f":"Head40","v":"YearTD budget"},{"$f":"Head41","v":"YTD variance"},{"$f":"Head41","v":"YTD variance"},{"$f":"Head8","v":"Full Year Forecast"}]
["R thousands",1,null,null,null,null,null,null,null,"%"]
["CASH FLOW FROM OPERATING ACTIVITIES"]
["Receipts"]
["Property rates, penalties & collection charges",null,null,189178890,null,{"$f":"'SC9'!J6","v":16692000},{"$f":"F7+8336000+10691000+26140000+10860000+11710000+11352000+14606000","v":110387000},{"$f":"D7/12*8","v":126119260},{"$f":"G7-H7","v":-15732260},{"$f":"IF(I7=0,\"\",I7/H7)","v":-0.12474113787220129},{"$f":"G7*12/8","v":165580500}]
["Service charges",null,null,911058804,null,{"$f":"'SC9'!J8+'SC9'!J9+'SC9'!J10+'SC9'!J11","v":51493000},{"$f":"F8+43912000+53561000+55636000+55496000+47318000+48180000+55901000","v":411497000},{"$f":"D8/12*8","v":607372536},{"$f":"G8-H8","v":-195875536},{"$f":"IF(I8=0,\"\",I8/H8)","v":-0.32249653118987914},{"$f":"G8*12/8","v":617245500}]
["Other revenue",null,null,{"$f":"8607269+4103202+39541+10535024+79072629","v":102357665},null,{"$f":"'SC9'!J13+'SC9'!J17+'SC9'!J18+'SC9'!J19+'SC9'!J21","v":11399000},{"$f":"F9+6292000+8310000+17879000+12661000+694000+28378000+12108000","v":97721000},68238443.333333328,29482556.666666672,0.43205201095589674,146581500]
["Government - operating",null,null,{"$f":"406586000","v":406586000},null,0,{"$f":"F10+170484000+78158000+322000","v":248964000},271057333.33333331,{"$f":"G10-H10","v":-22093333.333333313},-8.1507971253314118E-2,373446000]
["Government - capital",null,null,116451000,null,0,{"$f":"F11+40735000+38724000","v":79459000},77634000,{"$f":"G11-H11","v":1825000},{"$f":"IF(I11=0,\"\",I11/H11)","v":2.3507741453486875E-2},119188500]
["Interest",null,null,{"$f":"635000+112971000","v":113606000},null,{"$f":"'SC9'!J14+'SC9'!J15","v":863000},{"$f":"F12+475000+563000+1038000+843000+841000+641000+751000","v":6015000},75737333.333333328,{"$f":"G12-H12","v":-69722333.333333328},-0.92058077918419801,9022500]
["Dividends",null,null,13600,null,{"$f":"'C4-FinPerf RE'!F16","v":0},{"$f":"F13","v":0},9066.6666666666661,{"$f":"G13-H13","v":-9066.6666666666661},-1,0]
["Payments"]
["Suppliers and employees",null,null,{"$f":"'C4-FinPerf RE'!D26+'C4-FinPerf RE'!D27+'C4-FinPerf RE'!D28+'C4-FinPerf RE'!D29+'C4-FinPerf RE'!D31+'C4-FinPerf RE'!D32+'C4-FinPerf RE'!D33+'C4-FinPerf RE'!D35","v":1867822521},null,{"$f":"'C4-FinPerf RE'!F26+'C4-FinPerf RE'!F27+'C4-FinPerf RE'!F28+'C4-FinPerf RE'!F29+'C4-FinPerf RE'!F31+'C4-FinPerf RE'!F32+'C4-FinPerf RE'!F33+'C4-FinPerf RE'!F35","v":99236000},{"$f":"'C4-FinPerf RE'!G26+'C4-FinPerf RE'!G27+'C4-FinPerf RE'!G28+'C4-FinPerf RE'!G29+'C4-FinPerf RE'!G31+'C4-FinPerf RE'!G32+'C4-FinPerf RE'!G33+'C4-FinPerf RE'!G35","v":778910000},{"$f":"D15/12*8","v":1245215014},{"$f":"H15-G15","v":466305014},0.37447750690227383,{"$f":"G15*12/8","v":1168365000}]
["Finance charges",null,null,{"$f":"'C4-FinPerf RE'!D30","v":168000000},null,{"$f":"'C4-FinPerf RE'!F30","v":10157},{"$f":"'C4-FinPerf RE'!G30","v":9138157},112000000,{"$f":"H16-G16","v":102861843},0.91840931250000002,13707235.5]
["Transfers and Grants",null,null,{"$f":"'C4-FinPerf RE'!D34","v":32850000},null,{"$f":"'C4-FinPerf RE'!F34","v":3370000},{"$f":"'C4-FinPerf RE'!G34","v":3370000},21900000,{"$f":"H17-G17","v":18530000},0.84611872146118716,5055000]
["NET CASH FROM/(USED) OPERATING ACTIVITIES",null,{"$f":"SUM(C7:C13)+SUM(C15:C17)","v":0},3907924480,0,183063157,1745461157,2605282986.666667,{"$f":"H18-G18","v":859821829.66666698},0.33003010961460555,{"$f":"SUM(K7:K13)+SUM(K15:K17)","v":2618191735.5}]
[]
["CASH FLOWS FROM INVESTING ACTIVITIES"]
["Receipts"]
["Proceeds on disposal of PPE",null,null,null,null,null,null,null,{"$f":"G22-H22","v":0},{"$f":"IF(I22=0,\"\",I22/H22)","v":""}]
["Decrease (Increase) in non-current debtors",null,null,null,null,null,null,null,{"$f":"G23-H23","v":0},""]
["Decrease (increase) other non-current receivables",null,null,null,null,null,null,null,{"$f":"G24-H24","v":0},""]
["Decrease (increase) in non-current investments",null,null,null,null,null,null,null,{"$f":"G25-H25","v":0},""]
["Payments"]
["Capital assets",null,null,{"$f":"'C5-Capex'!D63","v":146450997},null,{"$f":"'C5-Capex'!F63","v":8532000},{"$f":"'C5-Capex'!G63","v":46271000},{"$f":"D27/12*8","v":97633998},{"$f":"H27-G27","v":51362998},0.52607697167128198,{"$f":"G27*12/8","v":69406500}]
["NET CASH FROM/(USED) INVESTING ACTIVITIES",null,{"$f":"SUM(C22:C25)+C27","v":0},{"$f":"SUM(D22:D25)+D27","v":146450997},0,8532000,46271000,97633998,{"$f":"H28-G28","v":51362998},0.52607697167128198,{"$f":"SUM(K22:K25)+K27","v":69406500}]
[]
["CASH FLOWS FROM FINANCING ACTIVITIES"]
["Receipts"]
["Short term loans",null,null,null,null,null,null,null,{"$f":"G32-H32","v":0},{"$f":"IF(I32=0,\"\",I32/H32)","v":""}]
["Borrowing long term/refinancing",null,null,null,null,null,null,null,{"$f":"G33-H33","v":0},""]
["Increase (decrease) in consumer deposits",null,null,null,null,null,null,null,{"$f":"G34-H34","v":0},""]
["Payments",null,null,null,null,null,null,null,null,""]
["Repayment of borrowing",null,null,null,null,null,null,null,{"$f":"H36-G36","v":0},""]
["NET CASH FROM/(USED) FINANCING ACTIVITIES",null,{"$f":"SUM(C32:C34)+C36","v":0},0,0,0,0,0,{"$f":"H37-G37","v":0},"",{"$f":"SUM(K32:K34)+K36","v":0}]
[]
["NET INCREASE/ (DECREASE) IN CASH HELD",null,{"$f":"C18+C28+C37","v":0},4054375477,0,191595157,1791732157,2702916984.666667,null,null,{"$f":"K18+K28+K37","v":2687598235.5}]
["Cash/cash equivalents at beginning:",null,null,null,null,null,null,{"$f":"IF(E40=0, D40, E40)","v":0},null,null,{"$f":"G40","v":0}]
["Cash/cash equivalents at month/year end:",null,{"$f":"C39+C40","v":0},{"$f":"D39+D40","v":4054375477},{"$f":"E39+E40","v":0},null,{"$f":"G39+G40","v":1791732157},{"$f":"H39+H40","v":2702916984.666667},null,null,{"$f":"K39+K40","v":2687598235.5}]
["References"]
["1. Material variances to be explained in Table SC1"]

{"sheet":"SC1","index":16,"n_rows":47,"n_cols":5,"rows_kept":47,"cut":false,"hidden":false,"merged":[[1,0,2,0],[1,1,2,1],[0,0,0,4]]}
[{"$f":"muni& \" - \"&S71G& \" - \"&date","v":"FS184 Matjhabeng - Supporting Table SC1 Material variance explanations  - M08 February"}]
[{"$f":"head27","v":"Ref"},{"$f":"desc","v":"Description"}]
[null,null,"Variance","Reasons for material deviations","Remedial or corrective steps/remarks"]
[null,"R thousands"]
[1,{"$f":"'C4-FinPerf RE'!A5","v":"Revenue By Source"}]
[null,"Property Rates",null,"Under collection on property rates","Stringent credit control and debt collection action to be taken"]
[null,"Service Charges ",null,"Under collection on service charges and losses","Stringent credit control and debt collection action to be taken"]
[]
[]
[2,{"$f":"'C4-FinPerf RE'!A25","v":"Expenditure By Type"}]
[null,"Other Expenditure",null,"Under expenditure due to cashflow constrains","Intensify revenue collection to ensure that creditors are paid"]
[null,null,null,null,"as per section 65 of the MFMA."]
[]
[]
[3,{"$f":"RIGHT('C5-Capex'!A40,19)","v":"Capital Expenditure"}]
[null,"MIG Expenditure",null,"Under-spending of MIG ","PMU to ensure that the complete documentation should"]
[null,null,null,null,"the finance department on time for verification and payment."]
[]
[]
[4,"Financial Position"]
[]
[]
[]
[]
[5,"Cash Flow"]
[]
[]
[]
[]
[6,"Measureable performance"]
[]
[]
[]
[]
[7,"Municipal Entities"]
[]
[]
[]
[]
[]
[{"$f":"head27a","v":"References"}]
["1. Revenue for each source, vote and standard classification"]
["2. Expenditure for each type, vote and standard classification"]
["3. Capital expenditure for each vote and standard classification"]
["4. Explain any material variances between the annual budget and the expected financial position based on current trends"]
["5. Cash receipts by source and cash payments by type where not explained under revenue and expenditure"]
["6. For Sept, Dec, Mar and Jun statements explain any material variances in achievement of measurable performance objectives"]

{"sheet":"SC2","index":17,"n_rows":65,"n_cols":8,"rows_kept":65,"cut":false,"hidden":false,"merged":[[1,0,2,0],[1,1,2,1],[1,2,2,2],[0,0,0,7]]}
[{"$f":"muni& \" - \"&S71H& \" - \"&Head57","v":"FS184 Matjhabeng - Supporting Table SC2 Monthly Budget Statement - performance indicators   - M08 February"}]
["Description of financial indicator","Basis of calculation",{"$f":"head27","v":"Ref"},{"$f":"Head1","v":"2014/15"},{"$f":"Head2","v":"Budget Year 2015/16"}]
[null,null,null,{"$f":"Head5","v":"Audited Outcome"},{"$f":"Head6","v":"Original Budget"},{"$f":"Head7","v":"Adjusted Budget"},{"$f":"Head39","v":"YearTD actual"},{"$f":"Head8","v":"Full Year Forecast"}]
[]
["Borrowing Management"]
[]
["Capital Charges to Operating Expenditure","Interest & principal paid/Operating Expenditure",null,{"$f":"IF(ISERROR((D42-D43)/D45),0,((D42-D43)/D45))","v":0},{"$f":"IF(ISERROR((E42+E44)/E45),0,((E42+E44)/E45))","v":0.1743535558859971},{"$f":"IF(ISERROR((F42+F44)/F45),0,((F42+F44)/F45))","v":0},{"$f":"IF(ISERROR((G42+G44)/G45),0,((G42+G44)/G45))","v":1.1546559703203776E-2},{"$f":"IF(ISERROR((H42+H44)/H45),0,((H42+H44)/H45))","v":3.6077207412364184E-2}]
["Borrowed funding of 'own' capital expenditure","Borrowings/Capital expenditure excl. transfers and grants",null,{"$f":"IF(ISERROR(D47/D46),0,(D47/D46))","v":0},{"$f":"IF(ISERROR(E47/E46),0,(E47/E46))","v":0},{"$f":"IF(ISERROR(F47/F46),0,(F47/F46))","v":0},{"$f":"IF(ISERROR(G47/G46),0,(G47/G46))","v":0},{"$f":"IF(ISERROR(H47/H46),0,(H47/H46))","v":0}]
["Safety of Capital"]
["Debt to Equity","Loans, Accounts Payable, Overdraft & Tax Provision/ Funds & Reserves",null,{"$f":"IF(ISERROR(D48/D49),0,(D48/D49))","v":0},{"$f":"IF(ISERROR(E48/E49),0,(E48/E49))","v":0.24300741585630414},{"$f":"IF(ISERROR(F48/F49),0,(F48/F49))","v":0},{"$f":"IF(ISERROR(G48/G49),0,(G48/G49))","v":-6.9355337479987636E-2},{"$f":"IF(ISERROR(H48/H49),0,(H48/H49))","v":-6.9355337479987636E-2}]
["Gearing","Long Term Borrowing/ Funds & Reserves",null,{"$f":"IF(ISERROR(D51/D50),0,(D51/D50))","v":0},{"$f":"IF(ISERROR(E51/E50),0,(E51/E50))","v":0},{"$f":"IF(ISERROR(F51/F50),0,(F51/F50))","v":0},{"$f":"IF(ISERROR(G51/G50),0,(G51/G50))","v":0},{"$f":"IF(ISERROR(H51/H50),0,(H51/H50))","v":0}]
["Liquidity"]
["Current Ratio","Current assets/current liabilities",1,{"$f":"IF(ISERROR(D52/D53),0,(D52/D53))","v":0},{"$f":"IF(ISERROR(E52/E53),0,(E52/E53))","v":1.5422243135536076},{"$f":"IF(ISERROR(F52/F53),0,(F52/F53))","v":0},{"$f":"IF(ISERROR(G52/G53),0,(G52/G53))","v":-11.888508200404404},{"$f":"IF(ISERROR(H52/H53),0,(H52/H53))","v":-11.888508200404404}]
["Liquidity Ratio","Monetary Assets/Current Liabilities",null,{"$f":"IF(ISERROR(D54/D53),0,(D54/D53))","v":0},{"$f":"IF(ISERROR(E54/E53),0,(E54/E53))","v":1.2558327714093055E-2},{"$f":"IF(ISERROR(F54/F53),0,(F54/F53))","v":0},{"$f":"IF(ISERROR(G54/G53),0,(G54/G53))","v":1.7152886991687262},{"$f":"IF(ISERROR(H54/H53),0,(H54/H53))","v":1.7152886991687262}]
["Revenue Management"]
["Annual Debtors Collection Rate \n(Payment Level %)","Last 12 Mths Receipts/ Last 12 Mths Billing"]
["Outstanding Debtors to Revenue","Total Outstanding Debtors to Annual Revenue",null,{"$f":"IF(ISERROR(D59/D55),0,(D59/D55))","v":0},{"$f":"IF(ISERROR(E59/E55),0,(E59/E55))","v":0.98427710786292155},{"$f":"IF(ISERROR(F59/F55),0,(F59/F55))","v":0},{"$f":"IF(ISERROR(G59/G55),0,(G59/G55))","v":0.18045364868006175},{"$f":"IF(ISERROR(H59/H55),0,(H59/H55))","v":0.18045364868006175}]
["Longstanding Debtors Recovered","Debtors > 12 Mths Recovered/Total Debtors > \n12 Months Old",null,{"$f":"IF(ISERROR(D64/D63),0,(D64/D63))","v":0},{"$f":"IF(ISERROR(E64/E63),0,(E64/E63))","v":0},{"$f":"IF(ISERROR(F64/F63),0,(F64/F63))","v":0},{"$f":"IF(ISERROR(G64/G63),0,(G64/G63))","v":0},{"$f":"IF(ISERROR(H64/H63),0,(H64/H63))","v":0}]
["Creditors Management"]
["Creditors System Efficiency","% of Creditors Paid Within Terms (within MFMA s 65(e))",null,null,null,null,null,{"$f":"G20*12/7","v":0}]
["Funding of Provisions"]
["Percentage Of Provisions Not Funded","Unfunded Provisions/Total Provisions"]
["Other Indicators"]
["Electricity Distribution Losses","% Volume (units purchased and generated less units sold)/units purchased and generated",2,null,null,null,null,{"$f":"G24*12/7","v":0}]
["Water Distribution Losses","% Volume (units purchased and own source less units sold)/Total units purchased and own source",2,null,null,null,null,0]
["Employee costs","Employee costs/Total Revenue - capital revenue",null,{"$f":"IF(ISERROR(D40/D55),0,(D40/D55))","v":0},{"$f":"IF(ISERROR(E40/E55),0,(E40/E55))","v":0.29152295867166},{"$f":"IF(ISERROR(F40/F55),0,(F40/F55))","v":0},{"$f":"IF(ISERROR(G40/G55),0,(G40/G55))","v":0.28532377080936744},{"$f":"IF(ISERROR(H40/H55),0,(H40/H55))","v":0.28532377080936744}]
["Repairs & Maintenance","R&M/Total Revenue - capital revenue",null,{"$f":"IF(ISERROR(D41/D55),0,(D41/D55))","v":0},{"$f":"IF(ISERROR(E41/E55),0,(E41/E55))","v":0.11096799164706818},{"$f":"IF(ISERROR(F41/F55),0,(F41/F55))","v":0},{"$f":"IF(ISERROR(G41/G55),0,(G41/G55))","v":1.8109663056630091E-2},{"$f":"IF(ISERROR(H41/H55),0,(H41/H55))","v":1.8109663056630091E-2}]
["Interest & Depreciation","I&D/Total Revenue - capital revenue",null,{"$f":"IF(ISERROR((D42+D44)/D55),0,((D42+D44)/D55))","v":0},{"$f":"IF(ISERROR((E42+E44)/E55),0,((E42+E44)/E55))","v":0.18470668232973592},{"$f":"IF(ISERROR((F42+F44)/F55),0,((F42+F44)/F55))","v":0},{"$f":"IF(ISERROR((G42+G44)/G55),0,((G42+G44)/G55))","v":6.8084234352368978E-3},{"$f":"IF(ISERROR((H42+H44)/H55),0,((H42+H44)/H55))","v":2.1272908185464883E-2}]
["IDP regulation financial viability indicators"]
["i. Debt coverage","(Total Operating Revenue - Operating Grants)/Debt service payments due within financial year)",null,null,{"$f":"('C4-FinPerf RE'!D23-'SC6'!D38)/'SC3'!K14","v":0.74912129791053728},null,{"$f":"('C4-FinPerf RE'!G23-'SC6'!G38)/'SC3'!K14","v":0.52947097560100476},{"$f":"G30*12/8","v":0.79420646340150713}]
["ii. O/S Service Debtors to Revenue","Total outstanding service debtors/annual revenue received for services",null,null,{"$f":"'SC3'!K14/'C4-FinPerf RE'!D23","v":1.0569513663378025},null,{"$f":"'SC3'!K14/'C4-FinPerf RE'!G37","v":2.6078880346816904},3.9118320520225356]
["iii. Cost coverage","(Available cash + Investments)/monthly fixed operational expenditure",null,null,{"$f":"('SC9'!O34+'SC5'!J24)/'C4-FinPerf RE'!D37","v":0.89369290703697613},null,{"$f":"('SC9'!E34+'SC5'!J24)/'C4-FinPerf RE'!G37","v":0.14000103361287933},0.21000155041931901]
["References"]
["1. Consumer debtors > 12 months old are excluded from current assets."]
["2. Material variances to be explained."]
[]
["Calculations"]
[{"$f":"'C6-FinPos'!A38","v":"Borrowing"},null,null,{"$f":"'C6-FinPos'!C38","v":0},{"$f":"'C6-FinPos'!D38","v":0},{"$f":"'C6-FinPos'!E38","v":0},{"$f":"'C6-FinPos'!F38","v":0},0]
["Total Assets",null,null,{"$f":"'C6-FinPos'!C26","v":0},{"$f":"'C6-FinPos'!D26","v":7767896092},{"$f":"'C6-FinPos'!E26","v":0},{"$f":"'C6-FinPos'!F26","v":237663000},{"$f":"'C6-FinPos'!G26","v":356494500}]
[{"$f":"'C4-FinPerf RE'!A26","v":"Employee related costs"},null,null,{"$f":"'C4-FinPerf RE'!C26","v":0},{"$f":"'C4-FinPerf RE'!D26","v":569262676},{"$f":"'C4-FinPerf RE'!E26","v":0},{"$f":"'C4-FinPerf RE'!G26","v":382957000},{"$f":"'C4-FinPerf RE'!K26","v":574435500}]
[{"$f":"A27","v":"Repairs & Maintenance"},null,null,null,216689403,0,{"$f":"SC13c!G76","v":24306500},{"$f":"G41*12/8","v":36459750}]
["Interest (finance charges)",null,null,{"$f":"'C4-FinPerf RE'!C30","v":0},{"$f":"'C4-FinPerf RE'!D30","v":168000000},{"$f":"'C4-FinPerf RE'!E30","v":0},{"$f":"'C4-FinPerf RE'!G30","v":9138157},{"$f":"'C4-FinPerf RE'!K30","v":13707235.5}]
["Principal paid",null,null,{"$f":"-'C7-CFlow'!C36","v":0},{"$f":"-'C7-CFlow'!D36","v":0},{"$f":"-'C7-CFlow'!E36","v":0},{"$f":"-'C7-CFlow'!G36","v":0},{"$f":"-'C7-CFlow'!K36","v":0}]
["Depreciation",null,null,{"$f":"'C4-FinPerf RE'!C29","v":0},{"$f":"'C4-FinPerf RE'!D29","v":192680410},{"$f":"'C4-FinPerf RE'!E29","v":0},null,{"$f":"'C4-FinPerf RE'!K27","v":29121000}]
["Operating expenditure",null,null,{"$f":"'C4-FinPerf RE'!C37","v":0},{"$f":"'C4-FinPerf RE'!D37","v":2068672521},{"$f":"'C4-FinPerf RE'!E37","v":0},{"$f":"'C4-FinPerf RE'!G37","v":791418157},{"$f":"'C4-FinPerf RE'!K37","v":1187127235.5}]
[{"$f":"'C5-Capex'!A40","v":"Total Capital Expenditure"},null,null,{"$f":"'C5-Capex'!C40","v":0},{"$f":"'C5-Capex'!D40","v":146450997},{"$f":"'C5-Capex'!E40","v":0},{"$f":"'C5-Capex'!G40","v":46271000},{"$f":"'C5-Capex'!K40","v":69406500}]
["Borrowed funding for capital",null,null,{"$f":"'C5-Capex'!C72","v":0},{"$f":"'C5-Capex'!D72","v":0},{"$f":"'C5-Capex'!E72","v":0},{"$f":"'C5-Capex'!G72","v":0},{"$f":"'C5-Capex'!K72","v":0}]
["Debt",null,null,{"$f":"'C6-FinPos'!C30+'C6-FinPos'!C31+'C6-FinPos'!C33+'C6-FinPos'!C38","v":0},{"$f":"'C6-FinPos'!D30+'C6-FinPos'!D31+'C6-FinPos'!D33+'C6-FinPos'!D38","v":1450000000},{"$f":"'C6-FinPos'!E30+'C6-FinPos'!E31+'C6-FinPos'!E33+'C6-FinPos'!E38","v":0},{"$f":"'C6-FinPos'!F30+'C6-FinPos'!F31+'C6-FinPos'!F33+'C6-FinPos'!F38","v":-17718000},{"$f":"'C6-FinPos'!G30+'C6-FinPos'!G31+'C6-FinPos'!G33+'C6-FinPos'!G38","v":-26577000}]
["Equity",null,null,{"$f":"'C6-FinPos'!C48","v":0},{"$f":"'C6-FinPos'!D48","v":5966896092},{"$f":"'C6-FinPos'!E48","v":0},{"$f":"'C6-FinPos'!F48","v":255467000},{"$f":"'C6-FinPos'!G48","v":383200500}]
[{"$f":"'C6-FinPos'!A47","v":"Reserves"},null,null,{"$f":"'C6-FinPos'!C47","v":0},{"$f":"'C6-FinPos'!D47","v":0},{"$f":"'C6-FinPos'!E47","v":0},{"$f":"'C6-FinPos'!F47","v":255467000},{"$f":"'C6-FinPos'!G47","v":383200500}]
[{"$f":"'C6-FinPos'!A38","v":"Borrowing"},null,null,{"$f":"'C6-FinPos'!C38","v":0},{"$f":"'C6-FinPos'!D38","v":0},{"$f":"'C6-FinPos'!E38","v":0},{"$f":"'C6-FinPos'!F38","v":0},{"$f":"'C6-FinPos'!G38","v":0}]
[{"$f":"'C6-FinPos'!A6","v":"Current assets"},null,null,{"$f":"'C6-FinPos'!C13","v":0},{"$f":"'C6-FinPos'!D13","v":2287118657},{"$f":"'C6-FinPos'!E13","v":0},{"$f":"'C6-FinPos'!F13","v":211663000},{"$f":"'C6-FinPos'!G13","v":317494500}]
[{"$f":"'C6-FinPos'!A29","v":"Current liabilities"},null,null,{"$f":"'C6-FinPos'!C35","v":0},{"$f":"'C6-FinPos'!D35","v":1483000000},{"$f":"'C6-FinPos'!E35","v":0},{"$f":"'C6-FinPos'!F35","v":-17804000},{"$f":"'C6-FinPos'!G35","v":-26706000}]
["Monetary assets",null,null,{"$f":"'C6-FinPos'!C7+'C6-FinPos'!C8","v":0},{"$f":"'C6-FinPos'!D7+'C6-FinPos'!D8","v":18624000},{"$f":"'C6-FinPos'!E7+'C6-FinPos'!E8","v":0},{"$f":"'C6-FinPos'!F7+'C6-FinPos'!F8","v":-30539000},{"$f":"'C6-FinPos'!G7+'C6-FinPos'!G8","v":-45808500}]
[{"$f":"'C4-FinPerf RE'!A23","v":"Total Revenue (excluding capital transfers and contributions)"},null,null,{"$f":"'C4-FinPerf RE'!C23","v":0},{"$f":"'C4-FinPerf RE'!D23","v":1952719877},{"$f":"'C4-FinPerf RE'!E23","v":0},{"$f":"'C4-FinPerf RE'!G23","v":1342184000},{"$f":"'C4-FinPerf RE'!K23","v":2013276000}]
[{"$f":"'C4-FinPerf RE'!A20","v":"Transfers recognised - operational"},null,null,{"$f":"'C4-FinPerf RE'!C20","v":0},{"$f":"'C4-FinPerf RE'!D20","v":406586000},{"$f":"'C4-FinPerf RE'!E20","v":0},{"$f":"'C4-FinPerf RE'!G20","v":249393000},{"$f":"'C4-FinPerf RE'!K20","v":374089500}]
[{"$f":"'C4-FinPerf RE'!A40","v":"Transfers recognised - capital"},null,null,{"$f":"'C4-FinPerf RE'!C40","v":0},{"$f":"'C4-FinPerf RE'!D40","v":116450997},{"$f":"'C4-FinPerf RE'!E40","v":0},{"$f":"'C4-FinPerf RE'!G40","v":80059000},{"$f":"'C4-FinPerf RE'!K40","v":120088500}]
["Debt service payments",null,null,{"$f":"'C7-CFlow'!C12+'C7-CFlow'!C36","v":0},{"$f":"'C7-CFlow'!D12+'C7-CFlow'!D36","v":113606000},{"$f":"'C7-CFlow'!E12+'C7-CFlow'!E36","v":0},{"$f":"'C7-CFlow'!G16+'C7-CFlow'!G36","v":9138157},{"$f":"'C7-CFlow'!K16+'C7-CFlow'!K36","v":13707235.5}]
["Outstanding debtors (receivables)",null,null,{"$f":"'C6-FinPos'!C9+'C6-FinPos'!C10+'C6-FinPos'!C11+'C6-FinPos'!C16","v":0},{"$f":"'C6-FinPos'!D9+'C6-FinPos'!D10+'C6-FinPos'!D11+'C6-FinPos'!D16","v":1922017473},{"$f":"'C6-FinPos'!E9+'C6-FinPos'!E10+'C6-FinPos'!E11+'C6-FinPos'!E16","v":0},{"$f":"'C6-FinPos'!F9+'C6-FinPos'!F10+'C6-FinPos'!F11+'C6-FinPos'!F16","v":242202000},{"$f":"'C6-FinPos'!G9+'C6-FinPos'!G10+'C6-FinPos'!G11+'C6-FinPos'!G16","v":363303000}]
["Annual services revenue",null,null,{"$f":"SUM('C4-FinPerf RE'!C8:C12)","v":0},{"$f":"SUM('C4-FinPerf RE'!D8:D12)","v":1138823505},{"$f":"SUM('C4-FinPerf RE'!E8:E12)","v":0},{"$f":"SUM('C4-FinPerf RE'!G8:G12)","v":725920000}]
["Cash + investments","Including LT investments",null,{"$f":"'C6-FinPos'!C7+'C6-FinPos'!C8+'C6-FinPos'!C17-'C6-FinPos'!C30","v":0},{"$f":"'C6-FinPos'!D7+'C6-FinPos'!D8+'C6-FinPos'!D17-'C6-FinPos'!D30","v":34401435},{"$f":"'C6-FinPos'!E7+'C6-FinPos'!E8+'C6-FinPos'!E17-'C6-FinPos'!E30","v":0},{"$f":"'C6-FinPos'!F7+'C6-FinPos'!F8+'C6-FinPos'!F17-'C6-FinPos'!F30","v":-4539000},{"$f":"'C6-FinPos'!G7+'C6-FinPos'!G8+'C6-FinPos'!G17-'C6-FinPos'!G30","v":-6808500}]
["Fixed operational expend. (monthly)",null,null,null,{"$f":"'C4-FinPerf RE'!D37","v":2068672521},null,{"$f":"'C4-FinPerf RE'!G37","v":791418157},{"$f":"G62*12/8","v":1187127235.5}]
["Longstanding debtors outstanding",null,null,{"$f":"'C6-FinPos'!C16","v":0},{"$f":"'C6-FinPos'!D16","v":0},{"$f":"'C6-FinPos'!E16","v":0},{"$f":"'C6-FinPos'!F16","v":0},{"$f":"'C6-FinPos'!G16","v":0}]
["Longstanding debtors recovered"]
["Attorney collections"]

{"sheet":"SC3","index":18,"n_rows":27,"n_cols":14,"rows_kept":27,"cut":false,"hidden":false,"merged":[[0,0,0,12],[1,2,1,13]]}
[{"$f":"muni& \" - \"&S71I& \" - \"&Head57","v":"FS184 Matjhabeng - Supporting Table SC3 Monthly Budget Statement - aged debtors - M08 February"}]
[{"$f":"desc","v":"Description"},null,{"$f":"Head2","v":"Budget Year 2015/16"}]
["R thousands","NT Code","0-30 Days","31-60 Days","61-90 Days","91-120 Days","121-150 Dys","151-180 Dys","181 Dys-1 Yr","Over 1Yr","Total","Total \nover 90 days","Actual Bad Debts Written Off against Debtors","Impairment - Bad Debts i.t.o Council Policy"]
["Debtors Age Analysis By Income Source"]
["Trade and Other Receivables from Exchange Transactions - Water",1200,{"$f":"[9]AD!$F$8","v":41442971.4499963},{"$f":"[9]AD!$G$8","v":33356332.339997001},{"$f":"[9]AD!$H$8","v":35513501.080000199},{"$f":"[9]AD!$I$8","v":35192183.279996797},{"$f":"[9]AD!$J$8","v":35212926.149999298},{"$f":"[9]AD!$K$8","v":16342624.050000699},{"$f":"[9]AD!$L$8","v":119208763.950001},{"$f":"[9]AD!$M$8","v":394848991.35998899},{"$f":"SUM(C5:J5)","v":711118293.6599803},{"$f":"SUM(F5:J5)","v":600805488.78998685}]
["Trade and Other Receivables from Exchange Transactions - Electricity",1300,{"$f":"[9]AD!$F$9","v":37414374.030000202},{"$f":"[9]AD!$G$9","v":12916036.420000101},{"$f":"[9]AD!$H$9","v":9020229.6899998095},{"$f":"[9]AD!$I$9","v":8535984.6499997396},{"$f":"[9]AD!$J$9","v":12841718.3400001},{"$f":"[9]AD!$K$9","v":8099368.0699998103},{"$f":"[9]AD!$L$9","v":29792144.889999799},{"$f":"[9]AD!$M$9","v":75880357.110000104},{"$f":"SUM(C6:J6)","v":194500213.19999969},{"$f":"SUM(F6:J6)","v":135149573.05999956}]
["Receivables from Non-exchange Transactions - Property Rates",1400,{"$f":"[9]AD!$F$10","v":19132066.569998901},{"$f":"[9]AD!$G$10","v":12980236.0900004},{"$f":"[9]AD!$H$10","v":8618880.2300001998},{"$f":"[9]AD!$I$10","v":7789138.0400002003},{"$f":"[9]AD!$J$10","v":7276253.5200002203},{"$f":"[9]AD!$K$10","v":6934383.3500002502},{"$f":"[9]AD!$L$10","v":35007972.670000598},{"$f":"[9]AD!$M$10","v":158974786.910007},{"$f":"SUM(C7:J7)","v":256713717.38000777},215982534.49000826]
["Receivables from Exchange Transactions - Waste Water Management",1500,{"$f":"[9]AD!$F$11","v":9622347.0000016205},{"$f":"[9]AD!$G$11","v":7815889.5699965796},{"$f":"[9]AD!$H$11","v":7330073.9499967303},{"$f":"[9]AD!$I$11","v":6826837.4499974698},{"$f":"[9]AD!$J$11","v":6338061.1599983703},{"$f":"[9]AD!$K$11","v":5776831.4699983997},{"$f":"[9]AD!$L$11","v":35614106.4400049},{"$f":"[9]AD!$M$11","v":170476172.16002199},249800319.20001605,225032008.68002114]
["Receivables from Exchange Transactions - Waste Management",1600,{"$f":"[9]AD!$F$12","v":5727558.4500055704},{"$f":"[9]AD!$G$12","v":4354230.6300041303},{"$f":"[9]AD!$H$12","v":4077600.8200037801},{"$f":"[9]AD!$I$12","v":3885486.8900036202},{"$f":"[9]AD!$J$12","v":3854303.1400035401},{"$f":"[9]AD!$K$12","v":3732503.4500035401},{"$f":"[9]AD!$L$12","v":24272925.400008101},{"$f":"[9]AD!$M$12","v":117836299.53004199},167740908.31007427,{"$f":"SUM(F9:J9)","v":153581518.41006079}]
["Receivables from Exchange Transactions - Property Rental Debtors",1700,{"$f":"[9]AD!$F$13","v":662800.06000000203},{"$f":"[9]AD!$G$13","v":648460.179999999},{"$f":"[9]AD!$H$13","v":642293.84999999905},{"$f":"[9]AD!$I$13","v":638630.60999999905},{"$f":"[9]AD!$J$13","v":642096.72999999905},{"$f":"[9]AD!$K$13","v":647753.46999999904},{"$f":"[9]AD!$L$13","v":4290141.5700000096},{"$f":"[9]AD!$M$13","v":36178364.649998501},44350541.119998507,{"$f":"SUM(F10:J10)","v":42396987.029998511}]
["Interest on Arrear Debtor Accounts",1810,{"$f":"[9]AD!$F$14","v":10713470.7599975},{"$f":"[9]AD!$G$14","v":10382219.170002401},{"$f":"[9]AD!$H$14","v":9997215.5399932992},{"$f":"[9]AD!$I$14","v":9566112.8400028907},{"$f":"[9]AD!$J$14","v":9431677.6799970493},{"$f":"[9]AD!$K$14","v":9133008.9399921205},{"$f":"[9]AD!$L$14","v":56649983.469979398},{"$f":"[9]AD!$M$14","v":297456151.720092},413329840.12005663,382236934.65006346]
["Recoverable unauthorised, irregular, fruitless and wasteful expenditure",1820,{"$f":"[9]AD!$F$15","v":0},{"$f":"[9]AD!$G$15","v":0},{"$f":"[9]AD!$H$15","v":0},{"$f":"[9]AD!$I$15","v":0},{"$f":"[9]AD!$J$15","v":0},{"$f":"[9]AD!$K$15","v":0},{"$f":"[9]AD!$L$15","v":0},{"$f":"[9]AD!$M$15","v":0},0,0]
["Other",1900,{"$f":"[9]AD!$F$16","v":2269269.1199999},{"$f":"[9]AD!$G$16","v":2173397.1499998998},{"$f":"[9]AD!$H$16","v":1637957.06999992},{"$f":"[9]AD!$I$16","v":972221.63999995403},{"$f":"[9]AD!$J$16","v":2965726.7500000498},{"$f":"[9]AD!$K$16","v":2884885.30000016},{"$f":"[9]AD!$L$16","v":6943341.9499987196},{"$f":"[9]AD!$M$16","v":6529310.1000036001},26376109.080002204,{"$f":"SUM(F13:J13)","v":20295485.740002483}]
["Total By Income Source",2000,{"$f":"SUM(C5:C13)","v":126984857.44000001},84626801.550000504,76837752.229993939,73406595.400000677,78562763.469998613,53551358.099994987,311779380.33999258,1258180433.540154,2063929942.0701356,{"$f":"SUM(L5:L13)","v":1775480530.850141},0,0]
[{"$f":"Head1&\" - totals only\"","v":"2014/15 - totals only"},null,null,null,null,null,null,null,null,null,{"$f":"SUM(C15:J15)","v":0},{"$f":"SUM(F15:J15)","v":0}]
["Debtors Age Analysis By Customer Group"]
["Organs of State",2200,{"$f":"[9]AD!$F$19","v":7128437.8600000003},{"$f":"[9]AD!$G$19","v":5716536.2200000007},{"$f":"[9]AD!$H$19","v":2703734.1399999987},{"$f":"[9]AD!$I$19","v":3154667.5000000005},{"$f":"[9]AD!$J$19","v":3429424.7199999997},{"$f":"[9]AD!$K$19","v":3025292.6100000003},{"$f":"[9]AD!$L$19","v":7349964.8299999982},{"$f":"[9]AD!$M$19","v":7979043.8499999996},{"$f":"SUM(C17:J17)","v":40487101.729999997},{"$f":"SUM(F17:J17)","v":24938393.509999998}]
["Commercial",2300,{"$f":"[9]AD!$F$20","v":41643740.91999992},{"$f":"[9]AD!$G$20","v":17408407.190000117},{"$f":"[9]AD!$H$20","v":14486641.630000085},{"$f":"[9]AD!$I$20","v":12949384.460000029},{"$f":"[9]AD!$J$20","v":12149640.479999971},{"$f":"[9]AD!$K$20","v":10683802.190000001},{"$f":"[9]AD!$L$20","v":56769140.23999995},{"$f":"[9]AD!$M$20","v":278167035.9399997},{"$f":"SUM(C18:J18)","v":444257793.04999977},{"$f":"SUM(F18:J18)","v":370719003.30999964}]
["Households",2400,{"$f":"[9]AD!$F$21","v":77281705.730005637},{"$f":"[9]AD!$G$21","v":60447009.830004841},{"$f":"[9]AD!$H$21","v":58940109.450002298},{"$f":"[9]AD!$I$21","v":56600765.500006527},{"$f":"[9]AD!$J$21","v":62275147.089998558},{"$f":"[9]AD!$K$21","v":39148978.889998667},{"$f":"[9]AD!$L$21","v":243138109.51997524},{"$f":"[9]AD!$M$21","v":959017866.23999524},{"$f":"SUM(C19:J19)","v":1556849692.2499871},{"$f":"SUM(F19:J19)","v":1360180867.2399743}]
["Other",2500,{"$f":"[9]AD!$F$22","v":930972.92999444902},{"$f":"[9]AD!$G$22","v":1054848.3099955469},{"$f":"[9]AD!$H$22","v":707267.00999155641},{"$f":"[9]AD!$I$22","v":701777.93999411911},{"$f":"[9]AD!$J$22","v":708551.18000008166},{"$f":"[9]AD!$K$22","v":693284.40999632329},{"$f":"[9]AD!$L$22","v":4522165.7500174046},{"$f":"[9]AD!$M$22","v":13016487.510159135},{"$f":"SUM(C20:J20)","v":22335355.040148616},{"$f":"SUM(F20:J20)","v":19642266.790167063}]
["Total By Customer Group",2600,{"$f":"SUM(C17:C20)","v":126984857.44000001},84626801.550000504,76837752.229993939,73406595.400000662,78562763.469998613,53551358.099994995,311779380.33999258,{"$f":"SUM(J17:J20)","v":1258180433.540154},{"$f":"SUM(K17:K20)","v":2063929942.0701356},{"$f":"SUM(L17:L20)","v":1775480530.850141},{"$f":"SUM(M17:M20)","v":0},{"$f":"SUM(N17:N20)","v":0}]
["Notes"]
["Material increases in value of debtors' categories compared to previous month to be explained"]
["Bad debts = amounts actually written off in the month"]
["Total by Income Source must reconcile with Total by Customer Group"]
[null,null,{"$f":"C14-C21","v":0},{"$f":"D14-D21","v":0},{"$f":"E14-E21","v":0},0,0,0,0,{"$f":"J14-J21","v":0},0]
[null,null,{"$f":"IF(C26=0,\"\",\"MUST AGREE\")","v":""},{"$f":"IF(D26=0,\"\",\"MUST AGREE\")","v":""},"","","","","","",""]

{"sheet":"SC4","index":19,"n_rows":17,"n_cols":12,"rows_kept":17,"cut":false,"hidden":false,"merged":[[1,1,3,1],[2,2,3,2],[2,3,3,3],[1,11,3,11],[0,0,0,10],[2,8,3,8],[2,9,3,9],[2,10,3,10],[2,4,3,4],[2,5,3,5],[2,6,3,6],[2,7,3,7],[1,0,2,0]]}
[{"$f":"muni& \" - \"&S71J& \" - \"&Head57","v":"FS184 Matjhabeng - Supporting Table SC4 Monthly Budget Statement - aged creditors  - M08 February"}]
[{"$f":"desc","v":"Description"},"NT Code",{"$f":"Head2","v":"Budget Year 2015/16"},null,null,null,null,null,null,null,null,"Prior year totals for chart (same period)"]
[null,null,"0 - \n30 Days","31 - \n60 Days","61 - \n90 Days","91 - \n120 Days","121 - \n150 Days","151 - \n180 Days","181 Days -\n1 Year","Over 1\nYear","Total\n"]
["R thousands"]
["Creditors Age Analysis By Customer Type"]
["Bulk Electricity","0100",39242000,39123000,40986000,489000,698505000,null,null,null,{"$f":"SUM(C6:J6)","v":818345000}]
["Bulk Water","0200",46637000,41427000,45020000,39757000,1324342000,null,null,null,{"$f":"SUM(C7:J7)","v":1497183000}]
["PAYE deductions","0300",null,null,null,null,null,null,null,null,0]
["VAT (output less input)","0400",null,null,null,null,null,null,null,null,0]
["Pensions / Retirement deductions","0500",null,null,null,null,null,null,null,null,0]
["Loan repayments","0600",null,null,null,null,null,null,null,null,0]
["Trade Creditors","0700",3114000,396000,1568000,13588000,3169000,0,38494000,null,60329000]
["Auditor General","0800",13945,55620,647000,2761000,2031000,30402,null,null,5538967]
["Other","0900",null,null,null,null,null,null,null,null,{"$f":"SUM(C14:J14)","v":0}]
["Total By Customer Type",1000,{"$f":"SUM(C6:C14)","v":89006945},{"$f":"SUM(D6:D14)","v":81001620},88221000,56595000,2028047000,30402,38494000,0,{"$f":"SUM(K6:K14)","v":2381395967},{"$f":"SUM(L6:L14)","v":0}]
["Notes"]
["Material increases in value of creditors' categories compared to previous month to be explained"]

{"sheet":"SC5","index":20,"n_rows":27,"n_cols":11,"rows_kept":27,"cut":false,"hidden":false,"merged":[[0,0,0,9],[1,1,2,1],[1,3,2,3],[1,4,2,4],[1,9,2,9],[1,5,2,5],[1,6,2,6],[1,7,2,7],[1,8,2,8]]}
[{"$f":"muni& \" - \"&S71K& \" - \"&Head57","v":"FS184 Matjhabeng - Supporting Table SC5 Monthly Budget Statement - investment portfolio  - M08 February"}]
["Investments by maturity\nName of institution & investment ID","Ref","Period of Investment","Type of Investment","Expiry date of investment","Accrued interest for the month","Yield for the month 1 \n(%)","Market value at beginning of the month","Change in market value","Market value at end of the month"," "]
["R thousands",null,"Yrs/Months"]
["Municipality"]
["Absa SEED Investment/ Budget reform (90 9461 7107)",null,"12 months","Savings",null,183000,null,26001000,{"$f":"-16500000-183000","v":-16683000},{"$f":"F5+H5+I5","v":9501000}]
["Absa Tragedy Trust (91 0653 8138)",null,"16 months","Savings",null,0,null,0,0,{"$f":"F6+H6+I6","v":0}]
["Absa MIG Funds (91 0668 4115)",null,"15 months","Savings",null,0,null,1000,0,1000]
["LED (91 0668 4157)",null,"17 months","Savings",null,0,null,1000,0,1000]
["Absa Equitable share & FMG (91 0668 4238)",null,"13 months","Savings",null,0,null,1000,0,1000]
["Skills development (91 1114 1338)",null,"18 months","Savings",null,0,null,1000,0,1000]
["Restructuring (91 2351 5666)",null,"18 months","Savings",null,0,null,1000,0,1000]
["Municipality sub-total",null,null,null,null,{"$f":"SUM(F5:F11)","v":183000},null,{"$f":"SUM(H5:H11)","v":26006000},{"$f":"SUM(I5:I11)","v":-16683000},{"$f":"SUM(J5:J11)","v":9506000}]
[]
["Entities"]
[]
[]
[]
[]
[]
[]
[]
["Entities sub-total",null,null,null,null,{"$f":"SUM(F15:F21)","v":0},null,{"$f":"SUM(H15:H21)","v":0},{"$f":"SUM(I15:I21)","v":0},{"$f":"SUM(J15:J21)","v":0}]
[]
["TOTAL INVESTMENTS AND INTEREST",2,null,null,null,{"$f":"F12+F22","v":183000},null,{"$f":"H12+H22","v":26006000},{"$f":"I12+I22","v":-16683000},{"$f":"J12+J22","v":9506000}]
[{"$f":"head27a","v":"References"}]
["1. Yield is calculated as the annualised equivalent"]
["2. Total market value must reconcile with the total of investments on the 'Financial Position statement'"]

{"sheet":"SC6","index":21,"n_rows":77,"n_cols":11,"rows_kept":77,"cut":false,"hidden":false,"merged":[[1,0,2,0],[1,1,2,1],[0,0,0,10]]}
[{"$f":"muni& \" - \"&S71L& \" - \"&Head57","v":"FS184 Matjhabeng - Supporting Table SC6 Monthly Budget Statement - transfers and grant receipts  - M08 February"}]
[{"$f":"desc","v":"Description"},{"$f":"head27","v":"Ref"},{"$f":"Head1","v":"2014/15"},{"$f":"Head2","v":"Budget Year 2015/16"}]
[null,null,{"$f":"Head5","v":"Audited Outcome"},{"$f":"Head6","v":"Original Budget"},{"$f":"Head7","v":"Adjusted Budget"},{"$f":"Head38","v":"Monthly actual"},{"$f":"Head39","v":"YearTD actual"},{"$f":"Head40","v":"YearTD budget"},{"$f":"Head41","v":"YTD variance"},{"$f":"Head41","v":"YTD variance"},{"$f":"Head8","v":"Full Year Forecast"}]
["R thousands",null,null,null,null,null,null,null,null,"%"]
["RECEIPTS:","1,2"]
[]
["Operating Transfers and Grants"]
["National Government:",null,{"$f":"SUM(C9:C19)","v":0},406586000,0,0,249393000,271057333.33333337,-22569000,{"$f":"IF(I8=0,\"\",I8/H8)","v":-8.3262827544480125E-2},{"$f":"SUM(K9:K19)","v":406586000}]
["Local Government Equitable Share",null,null,402909000,null,0,{"$f":"F9+167879000+78158000","v":246037000},{"$f":"D9/12*8","v":268606000},{"$f":"G9-H9","v":-22569000},-8.4022694950969076E-2,{"$f":"D9","v":402909000}]
["Finance Management ",null,null,1675000,null,0,{"$f":"F10+1675000","v":1675000},{"$f":"D10/12*8","v":1116666.6666666667},null,null,{"$f":"D10","v":1675000}]
["Municipal Systems Improvement",null,null,930000,null,0,{"$f":"F11+930000","v":930000},620000,null,null,930000]
["EPWP Incentive",null,null,1072000,null,0,{"$f":"F12+429000+322000","v":751000},714666.66666666663,null,null,1072000]
[]
[null,3,null,null,null,null,null,null,0,""]
[null,null,null,null,null,null,null,null,0,""]
[null,null,null,null,null,null,null,null,0,""]
[null,null,null,null,null,null,null,null,0,""]
[null,null,null,null,null,null,null,null,0,""]
["Other transfers and grants [insert description]",null,null,null,null,null,null,null,0,""]
["Provincial Government:",null,{"$f":"SUM(C21:C26)","v":0},0,0,0,0,0,0,"",{"$f":"SUM(K21:K26)","v":0}]
[null,null,null,null,null,null,null,null,{"$f":"G21-H21","v":0},""]
[]
[null,null,null,null,null,null,null,null,0,""]
[null,4,null,null,null,null,null,null,0,""]
[null,null,null,null,null,null,null,null,0,""]
["Other transfers and grants [insert description]",null,null,null,null,null,null,null,0,""]
["District Municipality:",null,{"$f":"SUM(C28:C29)","v":0},0,0,0,0,0,0,"",{"$f":"SUM(K28:K29)","v":0}]
["[insert description]",null,null,null,null,null,null,null,0,""]
[null,null,null,null,null,null,null,null,0,""]
["Other grant providers:",null,{"$f":"SUM(C31:C37)","v":0},0,0,0,0,0,0,"",{"$f":"SUM(K31:K37)","v":0}]
["[insert description]",null,null,null,null,null,null,null,0,""]
[]
[]
[]
[]
[]
[null,null,null,null,null,null,null,null,0,""]
["Total Operating Transfers and Grants",5,{"$f":"C8+C20+C27+C30","v":0},406586000,0,0,249393000,271057333.33333337,-22569000,-8.3262827544480125E-2,{"$f":"K8+K20+K27+K30","v":406586000}]
[]
["Capital Transfers and Grants"]
[{"$f":"A8","v":"National Government:"},null,{"$f":"SUM(C42:C51)","v":0},116451000,0,0,80059000,77634000,2425000,{"$f":"IF(I41=0,\"\",I41/H41)","v":3.1236313986140095E-2},116451000]
["Municipal Infrastructure Grant (MIG)",null,null,114651000,null,0,{"$f":"F42+40735000+38724000","v":79459000},{"$f":"D42/12*8","v":76434000},{"$f":"G42-H42","v":3025000},3.9576628202109006E-2,{"$f":"D42","v":114651000}]
[]
[]
[]
[]
["Integrated National Electrification Programme",null,null,1800000,null,0,{"$f":"F47+600000","v":600000},{"$f":"D47/12*8","v":1200000},-600000,-0.5,{"$f":"D47","v":1800000}]
["Energy Efficiency  and Demand Management",null,null,null,null,null,null,null,0,""]
[null,null,null,null,null,null,null,null,0,""]
[null,null,null,null,null,null,null,null,0,""]
["Other capital transfers [insert description]",null,null,null,null,null,null,null,0,""]
[{"$f":"A20","v":"Provincial Government:"},null,{"$f":"SUM(C53:C58)","v":0},0,0,0,0,0,{"$f":"G52-H52","v":0},{"$f":"IF(I52=0,\"\",I52/H52)","v":""},{"$f":"SUM(K53:K58)","v":0}]
["[insert description]",null,null,null,null,null,null,null,0,{"$f":"IF(I53=0,\"\",I53/H53)","v":""}]
[]
[]
[]
[]
[null,null,null,null,null,null,null,null,0,""]
[{"$f":"A27","v":"District Municipality:"},null,{"$f":"SUM(C60:C61)","v":0},0,0,0,0,0,0,"",{"$f":"SUM(K60:K61)","v":0}]
["[insert description]",null,null,null,null,null,null,null,0,""]
[null,null,null,null,null,null,null,null,0,""]
[{"$f":"A30","v":"Other grant providers:"},null,{"$f":"SUM(C63:C68)","v":0},0,0,0,0,0,0,"",{"$f":"SUM(K63:K68)","v":0}]
["[insert description]",null,null,null,null,null,null,null,0,{"$f":"IF(I63=0,\"\",I63/H63)","v":""}]
[]
[]
[]
[]
[null,null,null,null,null,null,null,null,0,""]
["Total Capital Transfers and Grants",5,{"$f":"C41+C52+C59+C62","v":0},{"$f":"D41+D52+D59+D62","v":116451000},0,0,80059000,77634000,2425000,3.1236313986140095E-2,116451000]
[]
["TOTAL RECEIPTS OF TRANSFERS & GRANTS",5,{"$f":"C38+C69","v":0},523037000,0,0,329452000,348691333.33333337,-20144000,-5.7770291585490123E-2,523037000]
[{"$f":"head27a","v":"References"}]
["1. Each grant is listed by name as gazetted together with the name of the transferring department or municipality, donor or other organisation"]
["2. Grant expenditure must be separately listed for each grant received"]
["3. Replacement of RSC levies"]
["4. Housing subsidies for housing where ownership transferred"]
["5. Total recurrent/capital grants and subsidies must reconcile to the 'Financial Performance' Statement"]

{"sheet":"SC7(1)","index":22,"n_rows":50,"n_cols":11,"rows_kept":50,"cut":false,"hidden":false,"merged":[[1,0,2,0],[1,1,2,1],[0,0,0,10]]}
[{"$f":"muni& \" - \"&S71M& \" - \"&Head57","v":"FS184 Matjhabeng - Supporting Table SC7(1) Monthly Budget Statement - transfers and grant expenditure  - M08 February"}]
[{"$f":"desc","v":"Description"},{"$f":"head27","v":"Ref"},{"$f":"Head1","v":"2014/15"},{"$f":"Head2","v":"Budget Year 2015/16"}]
[null,null,{"$f":"Head5","v":"Audited Outcome"},{"$f":"Head6","v":"Original Budget"},{"$f":"Head7","v":"Adjusted Budget"},{"$f":"Head38","v":"Monthly actual"},{"$f":"Head39","v":"YearTD actual"},{"$f":"Head40","v":"YearTD budget"},{"$f":"Head41","v":"YTD variance"},{"$f":"Head41","v":"YTD variance"},{"$f":"Head8","v":"Full Year Forecast"}]
["R thousands",null,null,null,null,null,null,null,null,"%"]
["EXPENDITURE"]
[]
["Operating expenditure of Transfers and Grants"]
[{"$f":"'SC6'!A8","v":"National Government:"},null,{"$f":"SUM(C9:C15)","v":0},406586000,0,199000,249429000,271057333.33333337,-21628333.333333336,{"$f":"IF(I8=0,\"\",I8/H8)","v":-7.9792467030345357E-2},{"$f":"SUM(K9:K15)","v":406586000}]
[{"$f":"'SC6'!A9","v":"Local Government Equitable Share"},null,null,402909000,null,0,{"$f":"F9+26126000+56870000+78774000+6108000+49999000+28160000","v":246037000},{"$f":"D9/12*8","v":268606000},{"$f":"G9-H9","v":-22569000},-8.4022694950969076E-2,{"$f":"D9","v":402909000}]
[{"$f":"'SC6'!A10","v":"Finance Management "},null,null,1675000,null,0,{"$f":"F10+1675000","v":1675000},{"$f":"D10/12*8","v":1116666.6666666667},558333.33333333326,0.49999999999999989,{"$f":"D10","v":1675000}]
[{"$f":"'SC6'!A11","v":"Municipal Systems Improvement"},null,null,930000,null,0,{"$f":"F11+362000+568000","v":930000},{"$f":"D11/12*8","v":620000},310000,0.5,{"$f":"D11","v":930000}]
[{"$f":"'SC6'!A12","v":"EPWP Incentive"},null,null,1072000,null,199000,{"$f":"F12+111000+102000+133000+242000","v":787000},{"$f":"D12/12*8","v":714666.66666666663},72333.333333333372,0.10121268656716424,{"$f":"D12","v":1072000}]
[{"$f":"'SC6'!A13","v":0},null,null,null,null,null,null,null,0,""]
[{"$f":"'SC6'!A14","v":0},null,null,null,null,null,null,null,0,""]
[{"$f":"'SC6'!A19","v":"Other transfers and grants [insert description]"},null,null,null,null,null,null,null,0,""]
[{"$f":"'SC6'!A20","v":"Provincial Government:"},null,{"$f":"SUM(C17:C21)","v":0},0,0,0,0,0,0,"",{"$f":"SUM(K17:K21)","v":0}]
[{"$f":"'SC6'!A21","v":0},null,null,null,null,null,null,null,{"$f":"G17-H17","v":0},""]
[{"$f":"'SC6'!A23","v":0},null,null,null,null,null,null,null,0,""]
[{"$f":"'SC6'!A24","v":0},null,null,null,null,null,null,null,0,""]
[{"$f":"'SC6'!A25","v":0},null,null,null,null,null,null,null,0,""]
[{"$f":"'SC6'!A26","v":"Other transfers and grants [insert description]"},null,null,null,null,null,null,null,0,""]
[{"$f":"'SC6'!A27","v":"District Municipality:"},null,{"$f":"SUM(C23:C24)","v":0},0,{"$f":"SUM(E23:E24)","v":0},0,0,0,0,"",{"$f":"SUM(K23:K24)","v":0}]
[null,null,null,null,null,null,null,null,0,""]
[{"$f":"'SC6'!A28","v":"[insert description]"},null,null,null,null,null,null,null,0,""]
[{"$f":"'SC6'!A30","v":"Other grant providers:"},null,{"$f":"SUM(C26:C27)","v":0},0,0,0,0,0,0,"",{"$f":"SUM(K26:K27)","v":0}]
[null,null,null,null,null,null,null,null,0,""]
[{"$f":"'SC6'!A31","v":"[insert description]"},null,null,null,null,null,null,null,0,""]
["Total operating expenditure of Transfers and Grants:",null,{"$f":"C8+C16+C22+C25","v":0},{"$f":"D8+D16+D22+D25","v":406586000},0,199000,249429000,271057333.33333337,-21628333.333333336,-7.9792467030345357E-2,{"$f":"K8+K16+K22+K25","v":406586000}]
[]
["Capital expenditure of Transfers and Grants"]
[{"$f":"'SC6'!A41","v":"National Government:"},null,{"$f":"SUM(C32:C37)","v":0},116451000,0,7634000,45116000,77634000,-32518000,{"$f":"IF(I31=0,\"\",I31/H31)","v":-0.4188628693613623},116451000]
[{"$f":"'SC6'!A42","v":"Municipal Infrastructure Grant (MIG)"},null,null,114651000,null,7634000,{"$f":"F32+5236000+5520000+8067000+5779000+3431000+1506000+7270000","v":44443000},{"$f":"D32/12*8","v":76434000},{"$f":"G32-H32","v":-31991000},-0.41854410340947745,{"$f":"D32","v":114651000}]
[{"$f":"'SC6'!A47","v":"Integrated National Electrification Programme"},null,null,1800000,null,0,{"$f":"F33","v":0},{"$f":"D33/12*8","v":1200000},-1200000,-1,{"$f":"D33","v":1800000}]
[{"$f":"'SC6'!A48","v":"Energy Efficiency  and Demand Management"},null,null,null,null,0,{"$f":"F34+673000","v":673000},{"$f":"D34/12*8","v":0},673000,{"$error":"#DIV/0!"},{"$f":"D34","v":0}]
[{"$f":"'SC6'!A49","v":0},null,null,null,null,null,null,{"$f":"D35/12*8","v":0},0,""]
[{"$f":"'SC6'!A50","v":0},null,null,null,null,null,null,null,0,""]
[{"$f":"'SC6'!A51","v":"Other capital transfers [insert description]"},null,null,null,null,null,null,null,0,""]
[{"$f":"'SC6'!A52","v":"Provincial Government:"},null,{"$f":"SUM(C39:C40)","v":0},0,0,0,0,0,{"$f":"G38-H38","v":0},"",{"$f":"SUM(K39:K40)","v":0}]
[null,null,null,null,null,null,null,null,0,""]
[{"$f":"'SC6'!A58","v":0},null,null,null,null,null,null,null,0,""]
[{"$f":"'SC6'!A59","v":"District Municipality:"},null,{"$f":"SUM(C42:C43)","v":0},0,0,0,0,0,0,"",{"$f":"SUM(K42:K43)","v":0}]
[null,null,null,null,null,null,null,null,0,""]
[{"$f":"'SC6'!A61","v":0},null,null,null,null,null,null,null,0,""]
[{"$f":"'SC6'!A62","v":"Other grant providers:"},null,{"$f":"SUM(C45:C46)","v":0},0,0,0,0,0,0,"",{"$f":"SUM(K45:K46)","v":0}]
[null,null,null,null,null,null,null,null,0,""]
[{"$f":"'SC6'!A68","v":0},null,null,null,null,null,null,null,0,""]
["Total capital expenditure of Transfers and Grants",null,{"$f":"C31+C38+C41+C44","v":0},{"$f":"D31+D38+D41+D44","v":116451000},0,7634000,45116000,77634000,-32518000,{"$f":"IF(I47=0,\"\",I47/H47)","v":-0.4188628693613623},116451000]
[]
["TOTAL EXPENDITURE OF TRANSFERS AND GRANTS",null,{"$f":"C28+C47","v":0},523037000,0,7833000,294545000,348691333.33333337,-54146333.333333336,{"$f":"IF(I49=0,\"\",I49/H49)","v":-0.15528442538481979},523037000]
[{"$f":"head27a","v":"References"}]

{"sheet":"SC7(2)","index":23,"n_rows":50,"n_cols":7,"rows_kept":50,"cut":false,"hidden":false,"merged":[[0,0,0,6],[1,0,2,0],[1,1,2,1],[1,2,1,6]]}
[{"$f":"muni& \" - \"&S71T& \" - \"&Head57","v":"FS184 Matjhabeng - Supporting Table SC7(2) Monthly Budget Statement - Expenditure against approved rollovers - M08 February"}]
[{"$f":"desc","v":"Description"},{"$f":"head27","v":"Ref"},{"$f":"Head2","v":"Budget Year 2015/16"}]
[null,null,{"$f":"\"Approved Rollover \" &Head1","v":"Approved Rollover 2014/15"},{"$f":"Head38","v":"Monthly actual"},{"$f":"Head39","v":"YearTD actual"},{"$f":"Head41","v":"YTD variance"},{"$f":"Head41","v":"YTD variance"}]
["R thousands",null,null,null,null,null,"%"]
["EXPENDITURE"]
[]
["Operating expenditure of Approved Roll-overs"]
[{"$f":"'SC6'!A8","v":"National Government:"},null,{"$f":"SUM(C9:C15)","v":0},{"$f":"SUM(D9:D15)","v":0},{"$f":"SUM(E9:E15)","v":0},{"$f":"SUM(F9:F15)","v":0},{"$f":"IF(F8=0,\"\",F8/C8)","v":""}]
[{"$f":"'SC6'!A9","v":"Local Government Equitable Share"},null,null,null,null,{"$f":"E9-C9","v":0},{"$f":"IF(F9=0,\"\",F9/C9)","v":""}]
[{"$f":"'SC6'!A10","v":"Finance Management "},null,null,null,null,{"$f":"C10-E10","v":0},""]
[{"$f":"'SC6'!A11","v":"Municipal Systems Improvement"},null,null,null,null,0,""]
[{"$f":"'SC6'!A12","v":"EPWP Incentive"},null,null,null,null,0,""]
[{"$f":"'SC6'!A13","v":0},null,null,null,null,0,""]
[{"$f":"'SC6'!A14","v":0},null,null,null,null,0,""]
[{"$f":"'SC6'!A19","v":"Other transfers and grants [insert description]"},null,null,null,null,0,""]
[{"$f":"'SC6'!A20","v":"Provincial Government:"},null,{"$f":"SUM(C17:C21)","v":0},{"$f":"SUM(D17:D21)","v":0},{"$f":"SUM(E17:E21)","v":0},{"$f":"SUM(F17:F21)","v":0},""]
[{"$f":"'SC6'!A21","v":0},null,null,null,null,{"$f":"C17-E17","v":0},""]
[{"$f":"'SC6'!A23","v":0},null,null,null,null,{"$f":"C18-E18","v":0},""]
[{"$f":"'SC6'!A24","v":0},null,null,null,null,{"$f":"C19-E19","v":0},""]
[{"$f":"'SC6'!A25","v":0},null,null,null,null,{"$f":"C20-E20","v":0},""]
[{"$f":"'SC6'!A26","v":"Other transfers and grants [insert description]"},null,null,null,null,{"$f":"C21-E21","v":0},""]
[{"$f":"'SC6'!A27","v":"District Municipality:"},null,{"$f":"SUM(C23:C24)","v":0},{"$f":"SUM(D23:D24)","v":0},{"$f":"SUM(E23:E24)","v":0},{"$f":"SUM(F23:F24)","v":0},""]
[null,null,null,null,null,{"$f":"C23-E23","v":0},""]
[{"$f":"'SC6'!A28","v":"[insert description]"},null,null,null,null,{"$f":"C24-E24","v":0},""]
[{"$f":"'SC6'!A30","v":"Other grant providers:"},null,{"$f":"SUM(C26:C27)","v":0},{"$f":"SUM(D26:D27)","v":0},{"$f":"SUM(E26:E27)","v":0},{"$f":"SUM(F26:F27)","v":0},""]
[null,null,null,null,null,{"$f":"C26-E26","v":0},""]
[{"$f":"'SC6'!A31","v":"[insert description]"},null,null,null,null,{"$f":"C27-E27","v":0},""]
["Total operating expenditure of Approved Roll-overs",null,{"$f":"C8+C16+C22+C25","v":0},{"$f":"D8+D16+D22+D25","v":0},{"$f":"E8+E16+E22+E25","v":0},{"$f":"F8+F16+F22+F25","v":0},""]
[null,null,null,null,null,null,""]
["Capital expenditure of Approved Roll-overs",null,null,null,null,null,""]
[{"$f":"'SC6'!A41","v":"National Government:"},null,{"$f":"SUM(C32:C37)","v":0},{"$f":"SUM(D32:D37)","v":0},{"$f":"SUM(E32:E37)","v":0},{"$f":"SUM(F32:F37)","v":0},""]
[{"$f":"'SC6'!A42","v":"Municipal Infrastructure Grant (MIG)"},null,null,null,null,{"$f":"C32-E32","v":0},""]
[{"$f":"'SC6'!A47","v":"Integrated National Electrification Programme"},null,null,null,null,0,""]
[{"$f":"'SC6'!A48","v":"Energy Efficiency  and Demand Management"},null,null,null,null,0,""]
[{"$f":"'SC6'!A49","v":0},null,null,null,null,0,""]
[{"$f":"'SC6'!A50","v":0},null,null,null,null,0,""]
[{"$f":"'SC6'!A51","v":"Other capital transfers [insert description]"},null,null,null,null,0,""]
[{"$f":"'SC6'!A52","v":"Provincial Government:"},null,{"$f":"SUM(C39:C40)","v":0},{"$f":"SUM(D39:D40)","v":0},{"$f":"SUM(E39:E40)","v":0},{"$f":"SUM(F39:F40)","v":0},""]
[null,null,null,null,null,{"$f":"C39-E39","v":0},""]
[{"$f":"'SC6'!A58","v":0},null,null,null,null,{"$f":"C40-E40","v":0},""]
[{"$f":"'SC6'!A59","v":"District Municipality:"},null,{"$f":"SUM(C42:C43)","v":0},{"$f":"SUM(D42:D43)","v":0},{"$f":"SUM(E42:E43)","v":0},{"$f":"SUM(F42:F43)","v":0},""]
[null,null,null,null,null,{"$f":"C42-E42","v":0},""]
[{"$f":"'SC6'!A61","v":0},null,null,null,null,{"$f":"C43-E43","v":0},""]
[{"$f":"'SC6'!A62","v":"Other grant providers:"},null,{"$f":"SUM(C45:C46)","v":0},{"$f":"SUM(D45:D46)","v":0},{"$f":"SUM(E45:E46)","v":0},{"$f":"SUM(F45:F46)","v":0},""]
[null,null,null,null,null,{"$f":"C45-E45","v":0},""]
[{"$f":"'SC6'!A68","v":0},null,null,null,null,{"$f":"C46-E46","v":0},""]
["Total capital expenditure of Approved Roll-overs",null,{"$f":"C31+C38+C41+C44","v":0},{"$f":"D31+D38+D41+D44","v":0},{"$f":"E31+E38+E41+E44","v":0},{"$f":"F31+F38+F41+F44","v":0},""]
[]
["TOTAL EXPENDITURE OF APPROVED ROLL-OVERS",null,{"$f":"C28+C47","v":0},{"$f":"D28+D47","v":0},{"$f":"E28+E47","v":0},{"$f":"F28+F47","v":0},""]
[{"$f":"head27a","v":"References"}]

{"sheet":"SC8","index":24,"n_rows":116,"n_cols":11,"rows_kept":116,"cut":false,"hidden":false,"merged":[[1,0,2,0],[1,1,2,1],[0,0,0,10]]}
[{"$f":"muni& \" - \"&S71N& \" - \"&Head57","v":"FS184 Matjhabeng - Supporting Table SC8 Monthly Budget Statement - councillor and staff benefits  - M08 February"}]
["Summary of Employee and Councillor remuneration",{"$f":"head27","v":"Ref"},{"$f":"Head1","v":"2014/15"},{"$f":"Head2","v":"Budget Year 2015/16"}]
[null,null,{"$f":"Head5","v":"Audited Outcome"},{"$f":"Head6","v":"Original Budget"},{"$f":"Head7","v":"Adjusted Budget"},{"$f":"Head38","v":"Monthly actual"},{"$f":"Head39","v":"YearTD actual"},{"$f":"Head40","v":"YearTD budget"},{"$f":"Head41","v":"YTD variance"},{"$f":"Head41","v":"YTD variance"},{"$f":"Head8","v":"Full Year Forecast"}]
["R thousands",null,null,null,null,null,null,null,null,"%"]
[null,1,"A","B","C",null,null,null,null,null,"D"]
["Councillors (Political Office Bearers plus Other)"]
["Basic Salaries and Wages",null,null,{"$f":"[6]SA22!$I$6","v":12438087.838127999},null,1463464,{"$f":"F7+1379000+1379000+1399000+14000000+1400000+1404000+2050000","v":24474464},{"$f":"D7/12*8","v":8292058.5587519994},{"$f":"G7-H7","v":16182405.441248},{"$f":"IF(I7=0,\"\",I7/H7)","v":1.9515546503428867},{"$f":"G7*12/8","v":36711696}]
["Pension and UIF Contributions",null,null,{"$f":"[6]SA22!$I$7","v":3266312.1657920005},null,216914,{"$f":"F8+188000+204000+204000+205000+205000+205000+217000","v":1644914},2177541.4438613337,-532627.44386133365,-0.24460037046038949,2467371]
["Medical Aid Contributions",null,null,{"$f":"[6]SA22!$I$8","v":933929.57232000015},null,48960,{"$f":"F9+48000+50000+50000+39000+49000+49000+49000","v":382960},622619.7148800001,-239659.7148800001,-0.38492150047993684,574440]
["Motor Vehicle Allowance",null,null,{"$f":"[6]SA22!$I$9","v":2108967},null,558721,{"$f":"F10+528000+528000+528000+528000+528000+528000+739000","v":4465721},1405978,{"$f":"G10-H10","v":3059743},{"$f":"IF(I10=0,\"\",I10/H10)","v":2.1762381772687767},6698581.5]
["Cellphone Allowance",null,null,{"$f":"[6]SA22!$I$10","v":2773.44},null,130432,{"$f":"F11+130000+130000+130000+130000+130000+130000+130000","v":1040432},1848.96,{"$f":"G11-H11","v":1038583.04},{"$f":"IF(I11=0,\"\",I11/H11)","v":561.71201107649711},1560648]
["Housing Allowances",null,null,{"$f":"[6]SA22!$I$11","v":0},null,0,{"$f":"F12","v":0},0,{"$f":"G12-H12","v":0},{"$f":"IF(I12=0,\"\",I12/H12)","v":""},0]
["Other benefits and allowances",null,null,{"$f":"[6]SA22!$I$12","v":8013256.3716480015},null,0,0,5342170.9144320013,-5342170.9144320013,-1,0]
["Sub Total - Councillors",null,{"$f":"SUM(C7:C13)","v":0},26763326.387888003,0,2418491,32008491,17842217.591925334,14166273.408074666,0.79397492688833415,48012736.5]
["% increase",4,null,{"$f":"IF(D14=0,\"\",(D14/C14)-1)","v":{"$error":"#DIV/0!"}},{"$f":"IF(E14=0,\"\",(E14/C14)-1)","v":""},null,null,null,null,null,{"$f":"IF(K14=0,\"\",(K14/C14)-1)","v":{"$error":"#DIV/0!"}}]
[]
["Senior Managers of the Municipality",3]
["Basic Salaries and Wages",null,null,{"$f":"[6]SA22!$I$17","v":7460459.9964000005},null,692461,{"$f":"F18+648000+648000+648000+648000+648000+661000+651000","v":5244461},{"$f":"D18/12*8","v":4973639.9976000004},{"$f":"G18-H18","v":270821.00239999965},{"$f":"IF(I18=0,\"\",I18/H18)","v":5.4451267588865031E-2},{"$f":"G18*12/8","v":7866691.5}]
["Pension and UIF Contributions",null,null,{"$f":"[6]SA22!$I$18","v":505284.94440000009},null,45436,{"$f":"F19+41000+41000+41000+42000+42000+41000+45000","v":338436},{"$f":"D19/12*8","v":336856.62960000004},1579.3703999999561,4.6885537086664361E-3,507654]
["Medical Aid Contributions",null,null,null,null,null,null,null,0,""]
["Overtime",null,null,null,null,null,null,null,0,""]
["Performance Bonus",null,null,null,null,null,null,null,{"$f":"G22-H22","v":0},{"$f":"IF(I22=0,\"\",I22/H22)","v":""}]
["Motor Vehicle Allowance",null,null,{"$f":"[6]SA22!$I$22","v":388245.77640000003},null,73267,{"$f":"F23+73000+73000+73000+73000+73000+73000+73000","v":584267},{"$f":"D23/12*8","v":258830.51760000002},{"$f":"G23-H23","v":325436.48239999998},{"$f":"IF(I23=0,\"\",I23/H23)","v":1.2573342796576008},{"$f":"G23*12/8","v":876400.5}]
["Cellphone Allowance",null,null,null,null,null,null,null,{"$f":"G24-H24","v":0},{"$f":"IF(I24=0,\"\",I24/H24)","v":""}]
["Housing Allowances",null,null,null,null,null,null,null,{"$f":"G25-H25","v":0},{"$f":"IF(I25=0,\"\",I25/H25)","v":""}]
["Other benefits and allowances",null,null,null,null,null,null,null,0,""]
["Payments in lieu of leave",null,null,null,null,null,null,null,0,""]
["Long service awards",null,null,null,null,null,null,null,0,""]
["Post-retirement benefit obligations",2,null,null,null,null,null,null,0,""]
["Sub Total - Senior Managers of Municipality",null,{"$f":"SUM(C18:C29)","v":0},8353990.7172000008,0,{"$f":"SUM(F18:F29)","v":811164},{"$f":"SUM(G18:G29)","v":6167164},{"$f":"SUM(H18:H29)","v":5569327.1447999999},597836.85520000011,{"$f":"IF(I30=0,\"\",I30/H30)","v":0.10734453905409233},9250746]
["% increase",4,null,{"$f":"IF(D30=0,\"\",(D30/C30)-1)","v":{"$error":"#DIV/0!"}},{"$f":"IF(E30=0,\"\",(E30/C30)-1)","v":""},null,null,null,null,null,{"$f":"IF(K30=0,\"\",(K30/C30)-1)","v":{"$error":"#DIV/0!"}}]
[]
["Other Municipal Staff"]
["Basic Salaries and Wages",null,null,{"$f":"[6]SA22!$I$33","v":318531982.0036},null,{"$f":"30098937-F7-F18","v":27943012},{"$f":"F34+26093000+26006000+31723000+27737000+28111000+28087000+27860000","v":223560012},{"$f":"D34/12*8","v":212354654.66906667},{"$f":"G34-H34","v":11205357.330933332},{"$f":"IF(I34=0,\"\",I34/H34)","v":5.2767184917117793E-2},{"$f":"G34*12/8","v":335340018}]
["Pension and UIF Contributions",null,null,{"$f":"[6]SA22!$I$34","v":47935067.055600002},null,{"$f":"4162220-F8-F19","v":3899870},{"$f":"F35+3840000+3831000+4550000+4025000+4030000+4022000+4047000","v":32244870},31956711.3704,288158.62959999964,9.0171553092571171E-3,48367305]
["Medical Aid Contributions",null,null,{"$f":"[6]SA22!$I$35","v":32626138},null,{"$f":"3460492-F9","v":3411532},{"$f":"F36+2924000+2919000+2950000+2926000+2908000+2887000+3291000","v":24216532},21750758.666666668,2465773.3333333321,0.11336493458097915,36324798]
["Overtime",null,null,{"$f":"[6]SA22!$I$36","v":49353532},null,5961233,{"$f":"F37+3431000+4467000+4956000+4017000+4342000+4842000+5259000","v":37275233},32902354.666666668,4372878.3333333321,0.13290472300948994,55912849.5]
["Performance Bonus",null,null,{"$f":"[6]SA22!$F$37","v":0},null,0,{"$f":"F38","v":0},0,0,"",0]
["Motor Vehicle Allowance",null,null,{"$f":"[6]SA22!$I$38","v":30950005.2236},null,{"$f":"3134904+218620-F10-F23","v":2721536},{"$f":"F39+2358000+2365000+2704000+2345000+2535000+2454000+2640000","v":20122536},20633336.815733332,{"$f":"G39-H39","v":-510800.81573333219},{"$f":"IF(I39=0,\"\",I39/H39)","v":-2.4756093514832576E-2},30183804]
["Cellphone Allowance",null,null,{"$f":"[6]SA22!$I$39","v":1584072},null,{"$f":"149298-F11","v":18866},{"$f":"F40+19000+19000+19000+19000+19000+18000+18000","v":149866},1056048,{"$f":"G40-H40","v":-906182},{"$f":"IF(I40=0,\"\",I40/H40)","v":-0.85808788994439644},224799]
["Housing Allowances",null,null,{"$f":"[6]SA22!$I$40","v":2651095},null,{"$f":"306760-F12","v":306760},{"$f":"F41+293000+247000+314000+369000+312000+311000+308000","v":2460760},1767396.6666666667,{"$f":"G41-H41","v":693363.33333333326},{"$f":"IF(I41=0,\"\",I41/H41)","v":0.3923077068154856},3691140]
["Other benefits and allowances",null,null,{"$f":"[6]SA22!$I$41","v":56006291},null,{"$f":"1710491+289841+16878+12500+110138+463685","v":2603533},{"$f":"F42+1860000+1980000+2246000+2060000+2130000+2208000+2344000","v":17431533},37337527.333333336,-19905994.333333336,-0.53313638462507729,26147299.5]
["Payments in lieu of leave",null,null,{"$f":"[6]SA22!$I$42","v":21002009},null,{"$f":"2117368+1462451","v":3579819},{"$f":"F43+1429000+2796000+2193000+260000+3725000+1935000+1912000","v":17829819},14001339.333333334,3828479.666666666,0.27343667455813386,26744728.5]
["Long service awards",null,null,{"$f":"[6]SA22!$I$43","v":268494},null,138082,{"$f":"F44+119000+179000+268000+29000+371000+156000+238000","v":1498082},178996,1319086,7.3693602091666852,2247123]
["Post-retirement benefit obligations",2,null,{"$f":"[6]SA22!$I$44","v":0},null,0,0,0,0,"",0]
["Sub Total - Other Municipal Staff",null,{"$f":"SUM(C34:C45)","v":0},560908685.28279996,0,{"$f":"SUM(F34:F45)","v":50584243},{"$f":"SUM(G34:G45)","v":376789243},{"$f":"SUM(H34:H45)","v":373939123.52186662},2850119.4781333804,{"$f":"IF(I46=0,\"\",I46/H46)","v":7.6218809395768279E-3},565183864.5]
["% increase",4,null,{"$f":"IF(D46=0,\"\",(D46/C46)-1)","v":{"$error":"#DIV/0!"}},{"$f":"IF(E46=0,\"\",(E46/C46)-1)","v":""},null,null,null,null,null,{"$f":"IF(K46=0,\"\",(K46/C46)-1)","v":{"$error":"#DIV/0!"}}]
[]
["Total Parent Municipality",null,{"$f":"C14+C30+C46","v":0},{"$f":"D14+D30+D46","v":596026002.38788795},0,53813898,414964898,397350668.25859195,{"$f":"G49-H49","v":17614229.74140805},{"$f":"IF(I49=0,\"\",I49/H49)","v":4.4329181120050062E-2},622447347]
[null,null,null,{"$f":"IF(D49=0,\"\",(D49/C49)-1)","v":{"$error":"#DIV/0!"}},{"$f":"IF(E49=0,\"\",(E49/C49)-1)","v":""},null,null,null,null,null,{"$f":"IF(K49=0,\"\",(K49/C49)-1)","v":{"$error":"#DIV/0!"}}]
["Unpaid salary, allowances & benefits in arrears:"]
[]
["Board Members of Entities"]
["Basic Salaries and Wages",null,null,null,null,null,null,null,{"$f":"G54-H54","v":0},{"$f":"IF(I54=0,\"\",I54/H54)","v":""}]
["Pension and UIF Contributions",null,null,null,null,null,null,null,0,""]
["Medical Aid Contributions",null,null,null,null,null,null,null,0,""]
["Overtime",null,null,null,null,null,null,null,{"$f":"G57-H57","v":0},{"$f":"IF(I57=0,\"\",I57/H57)","v":""}]
["Performance Bonus",null,null,null,null,null,null,null,{"$f":"G58-H58","v":0},{"$f":"IF(I58=0,\"\",I58/H58)","v":""}]
["Motor Vehicle Allowance",null,null,null,null,null,null,null,{"$f":"G59-H59","v":0},{"$f":"IF(I59=0,\"\",I59/H59)","v":""}]
["Cellphone Allowance",null,null,null,null,null,null,null,{"$f":"G60-H60","v":0},{"$f":"IF(I60=0,\"\",I60/H60)","v":""}]
["Housing Allowances",null,null,null,null,null,null,null,{"$f":"G61-H61","v":0},{"$f":"IF(I61=0,\"\",I61/H61)","v":""}]
["Other benefits and allowances",null,null,null,null,null,null,null,0,""]
["Board Fees",null,null,null,null,null,null,null,{"$f":"G63-H63","v":0},{"$f":"IF(I63=0,\"\",I63/H63)","v":""}]
["Payments in lieu of leave",null,null,null,null,null,null,null,0,""]
["Long service awards",null,null,null,null,null,null,null,0,""]
["Post-retirement benefit obligations",null,null,null,null,null,null,null,0,""]
["Sub Total - Board Members of Entities",2,{"$f":"SUM(C54:C66)","v":0},0,0,{"$f":"SUM(F54:F66)","v":0},{"$f":"SUM(G54:G66)","v":0},{"$f":"SUM(H54:H66)","v":0},0,{"$f":"IF(I67=0,\"\",I67/H67)","v":""},0]
["% increase",4,null,{"$f":"IF(D67=0,\"\",(D67/C67)-1)","v":""},{"$f":"IF(E67=0,\"\",(E67/C67)-1)","v":""},null,null,null,null,null,{"$f":"IF(K67=0,\"\",(K67/C67)-1)","v":""}]
[]
["Senior Managers of Entities"]
["Basic Salaries and Wages",null,null,null,null,null,null,null,{"$f":"G71-H71","v":0},{"$f":"IF(I71=0,\"\",I71/H71)","v":""}]
["Pension and UIF Contributions",null,null,null,null,null,null,null,0,""]
["Medical Aid Contributions",null,null,null,null,null,null,null,0,""]
["Overtime",null,null,null,null,null,null,null,0,""]
["Performance Bonus",null,null,null,null,null,null,null,{"$f":"G75-H75","v":0},{"$f":"IF(I75=0,\"\",I75/H75)","v":""}]
["Motor Vehicle Allowance",null,null,null,null,null,null,null,{"$f":"G76-H76","v":0},{"$f":"IF(I76=0,\"\",I76/H76)","v":""}]
["Cellphone Allowance",null,null,null,null,null,null,null,{"$f":"G77-H77","v":0},{"$f":"IF(I77=0,\"\",I77/H77)","v":""}]
["Housing Allowances",null,null,null,null,null,null,null,{"$f":"G78-H78","v":0},{"$f":"IF(I78=0,\"\",I78/H78)","v":""}]
["Other benefits and allowances",null,null,null,null,null,null,null,0,""]
["Payments in lieu of leave",null,null,null,null,null,null,null,0,""]
["Long service awards",null,null,null,null,null,null,null,0,""]
["Post-retirement benefit obligations",2,null,null,null,null,null,null,0,""]
["Sub Total - Senior Managers of Entities",null,{"$f":"SUM(C71:C82)","v":0},0,0,{"$f":"SUM(F71:F82)","v":0},{"$f":"SUM(G71:G82)","v":0},{"$f":"SUM(H71:H82)","v":0},0,{"$f":"IF(I83=0,\"\",I83/H83)","v":""},0]
["% increase",4,null,{"$f":"IF(D83=0,\"\",(D83/C83)-1)","v":""},{"$f":"IF(E83=0,\"\",(E83/C83)-1)","v":""},null,null,null,null,null,{"$f":"IF(K83=0,\"\",(K83/C83)-1)","v":""}]
[]
["Other Staff of Entities"]
["Basic Salaries and Wages",null,null,null,null,null,null,null,{"$f":"G87-H87","v":0},{"$f":"IF(I87=0,\"\",I87/H87)","v":""}]
["Pension and UIF Contributions",null,null,null,null,null,null,null,0,""]
["Medical Aid Contributions",null,null,null,null,null,null,null,{"$f":"G89-H89","v":0},{"$f":"IF(I89=0,\"\",I89/H89)","v":""}]
["Overtime",null,null,null,null,null,null,null,{"$f":"G90-H90","v":0},{"$f":"IF(I90=0,\"\",I90/H90)","v":""}]
["Performance Bonus",null,null,null,null,null,null,null,{"$f":"G91-H91","v":0},{"$f":"IF(I91=0,\"\",I91/H91)","v":""}]
["Motor Vehicle Allowance",null,null,null,null,null,null,null,{"$f":"G92-H92","v":0},{"$f":"IF(I92=0,\"\",I92/H92)","v":""}]
["Cellphone Allowance",null,null,null,null,null,null,null,0,""]
["Housing Allowances",null,null,null,null,null,null,null,0,""]
["Other benefits and allowances",null,null,null,null,null,null,null,0,""]
["Payments in lieu of leave",null,null,null,null,null,null,null,0,""]
["Long service awards",null,null,null,null,null,null,null,0,""]
["Post-retirement benefit obligations",null,null,null,null,null,null,null,0,""]
["Sub Total - Other Staff of Entities",null,{"$f":"SUM(C87:C98)","v":0},0,0,0,0,0,0,{"$f":"IF(I99=0,\"\",I99/H99)","v":""},{"$f":"SUM(K87:K98)","v":0}]
["% increase",4,null,{"$f":"IF(D99=0,\"\",(D99/C99)-1)","v":""},{"$f":"IF(E99=0,\"\",(E99/C99)-1)","v":""},null,null,null,null,null,{"$f":"IF(K99=0,\"\",(K99/C99)-1)","v":""}]
[]
["Total Municipal Entities",null,{"$f":"C67+C83+C99","v":0},0,0,0,0,0,{"$f":"G102-H102","v":0},{"$f":"IF(I102=0,\"\",I102/H102)","v":""},{"$f":"K67+K83+K99","v":0}]
[]
["TOTAL SALARY, ALLOWANCES & BENEFITS",null,{"$f":"C49+C102","v":0},596026002.38788795,0,53813898,414964898,397350668.25859195,{"$f":"G104-H104","v":17614229.74140805},{"$f":"IF(I104=0,\"\",I104/H104)","v":4.4329181120050062E-2},{"$f":"K49+K102","v":622447347}]
["% increase",4,null,{"$f":"IF(D104=0,\"\",(D104/C104)-1)","v":{"$error":"#DIV/0!"}},{"$f":"IF(E104=0,\"\",(E104/C104)-1)","v":""},null,null,null,null,null,{"$f":"IF(K104=0,\"\",(K104/C104)-1)","v":{"$error":"#DIV/0!"}}]
["TOTAL MANAGERS AND STAFF",null,{"$f":"C30+C46+C83+C99","v":0},569262676,0,51395407,382956407,379508450.66666663,3447956.3333333805,{"$f":"IF(I106=0,\"\",I106/H106)","v":9.0853216240020466E-3},{"$f":"K30+K46+K83+K99","v":574434610.5}]
[{"$f":"head27a","v":"References"}]
["1. Include 'Loans and advances' where applicable if any reportable amounts until phased compliance with s164 of MFMA achieved"]
["2. If benefits in kind are provided (e.g. provision of living quarters) the full market value must be shown as the cost to the municipality"]
["3. s57 of the Systems Act"]
["4. B/A, C/A, D/A"]
["Column Definitions:"]
["A. Audited actual 2005/06 (audited financial statements). If audited amounts unavailable, unaudited amounts must be provided with a note stating these are unaudited"]
["B. The original budget approved by council for the 2006/07 budget year."]
["C. The budget for 2006/07 budget year as adjusted by council resolution in terms of section 28 of the MFMA."]
["D. An estimate of final actual amounts (pre audit - 2006/07 budget year) at the time of preparing the budget for the 2007/08 budget year. This may differ from C."]

{"sheet":"SC9","index":25,"n_rows":67,"n_cols":17,"rows_kept":67,"cut":false,"hidden":false,"merged":[[2,15,3,15],[2,16,3,16],[1,0,2,0],[2,14,3,14],[1,1,2,1],[1,2,1,13],[1,14,1,16]]}
[{"$f":"muni& \" - \"&S71O& \" - \"&Head57","v":"FS184 Matjhabeng - Supporting Table SC9 Monthly Budget Statement - actuals and revised targets for cash receipts - M08 February"}]
[{"$f":"desc","v":"Description"},{"$f":"head27","v":"Ref"},{"$f":"Head2","v":"Budget Year 2015/16"},null,null,null,null,null,null,null,null,null,null,null,{"$f":"'Template names'!B5","v":"2015/16 Medium Term Revenue & Expenditure Framework"}]
[null,null,"July","August","Sept","October","Nov","Dec","January","Feb","March","April","May","June",{"$f":"Head9","v":"Budget Year 2015/16"},{"$f":"Head10","v":"Budget Year +1 2016/17"},{"$f":"Head11","v":"Budget Year +2 2017/18"}]
["R thousands",1,"Outcome","Outcome","Outcome","Outcome","Outcome","Outcome","Budget","Budget","Budget","Budget","Budget","Budget"]
["Cash Receipts By Source"]
["Property rates",null,8335727,10691086,26140084,10859698,11710239,11351983,14606000,16692000,15765000,15765000,15765000,{"$f":"O6-SUM(C6:M6)","v":31497073},{"$f":"'C4-FinPerf RE'!D6","v":189178890},{"$f":"[7]Sheet1!$R$7","v":235161444},{"$f":"[7]Sheet1!$S$7","v":248469510}]
["Property rates - penalties & collection charges",null,null,null,null,null,null,null,null,null,null,null,null,0,0,{"$f":"[7]Sheet1!$R$8","v":0},{"$f":"[7]Sheet1!$S$8","v":0}]
["Service charges - electricity revenue",null,28366348,35756008,37439511,38870317,30180710,31275832,36733000,34358000,62168712.308999993,62168712.308999993,62168712.308999993,137333775.07299995,596819638,{"$f":"[7]Sheet1!$R$9","v":835547493},{"$f":"[7]Sheet1!$S$9","v":882338153}]
["Service charges - water revenue",null,8372519,10133567,10192524,9387971,9583762,9706761,11605000,11109000,16990772.066666666,16990772.066666666,16990772.066666666,32047991.800000012,163111412,{"$f":"[7]Sheet1!$R$10","v":212044835},{"$f":"[7]Sheet1!$S$10","v":223919346}]
["Service charges - sanitation revenue",null,4786804,4851894,5193500,4740249,4926182,4682472,4925000,3719000,10073531.715333333,10073531.715333333,10073531.715333333,28660208.854000002,96705905,{"$f":"[7]Sheet1!$R$11","v":128014441},{"$f":"[7]Sheet1!$S$11","v":135183250}]
["Service charges - refuse",null,2386708,2819630,2810545,2497058,2627842,2514457,2638000,2307000,5668942.5573333325,5668942.5573333325,5668942.5573333325,16813781.328000002,54421849,{"$f":"[7]Sheet1!$R$12","v":72040922},{"$f":"[7]Sheet1!$S$12","v":76075214}]
["Service charges - other",null,null,null,null,null,null,0,0,null,0,0,0,0,0,{"$f":"[7]Sheet1!$R$13","v":0},{"$f":"[7]Sheet1!$S$13","v":0}]
["Rental of facilities and equipment",null,390153,482235,469422,407553,519350,378590,433000,512000,896590.5,896590.5,896590.5,2325194.5,8607269,{"$f":"[7]Sheet1!$R$14","v":9115098},{"$f":"[7]Sheet1!$S$14","v":9625543}]
["Interest earned - external investments",null,0,0,307682,135648,134980,127856,162000,264000,52916.666666666664,52916.666666666664,52916.666666666664,-655916.00000000023,{"$f":"'C4-FinPerf RE'!D14","v":635000},{"$f":"[7]Sheet1!$R$15","v":672465},{"$f":"[7]Sheet1!$S$15","v":710123}]
["Interest earned - outstanding debtors",null,474914,562992,730779,707514,706191,513295,589000,599000,9414250,9414250,9414250,79844565,{"$f":"'C4-FinPerf RE'!D15","v":112971000},{"$f":"[7]Sheet1!$R$16","v":117040481},{"$f":"[7]Sheet1!$S$15","v":710123}]
["Dividends received",null,0,0,0,0,0,0,0,0,1416.6666666666667,1416.6666666666667,1416.6666666666667,9350,13600,{"$f":"[7]Sheet1!$R$17","v":14402},{"$f":"[7]Sheet1!$S$17","v":15209}]
["Fines",null,178000,260042,202633,256802,168939,207082,218000,209000,341933.5,341933.5,341933.5,1376903.5,{"$f":"'C4-FinPerf RE'!D17","v":4103202},{"$f":"[7]Sheet1!$R$18","v":4345291},{"$f":"[7]Sheet1!$S$18","v":4588627}]
["Licences and permits",null,5000,9675,4982,2421,5263,4386,5000,10000,3295.0833333333335,3295.0833333333335,3295.0833333333335,-17071.250000000007,{"$f":"'C4-FinPerf RE'!D18","v":39541},{"$f":"[7]Sheet1!$R$19","v":41874},{"$f":"[7]Sheet1!$S$19","v":44219}]
["Agency services",null,null,null,null,null,null,0,0,896000,877918.66666666663,877918.66666666663,877918.66666666663,7005268,{"$f":"'C4-FinPerf RE'!D19","v":10535024},{"$f":"[7]Sheet1!$R$20","v":11156590},{"$f":"[7]Sheet1!$S$20","v":11781359}]
["Transfer receipts - operating",null,170484000,429000,0,0,0,78158000,322000,0,33882166.666666664,33882166.666666664,33882166.666666664,55546499.99999994,{"$f":"'C4-FinPerf RE'!D20","v":406586000},{"$f":"[7]Sheet1!$R$21","v":380493000},{"$f":"[7]Sheet1!$S$21","v":363128000}]
["Other revenue",null,5718858,7558420,17201698,{"$f":"4990910+7003381","v":11994291},12406433,27787928,11452000,9772000,6589385.75,6589385.75,6589385.75,-44587156.25,{"$f":"'C4-FinPerf RE'!D21","v":79072629},{"$f":"[7]Sheet1!$R$22","v":63413912},{"$f":"[7]Sheet1!$S$22","v":66965091}]
["Cash Receipts by Source",null,{"$f":"SUM(C6:C21)","v":229499031},73554549,100693360,79859522,72969891,166708642,83688000,80447000,162726832.14833331,162726832.14833331,162726832.14833331,347200467.55499989,1722800959,2069102248,2023553767]
[null,null,null,null,null,null,null,null,null,null,null,null,null,{"$f":"O23-SUM(C23:M23)","v":0}]
["Other Cash Flows by Source",null,null,null,null,null,null,null,null,null,null,null,null,0]
["Transfer receipts - capital",null,40735000,0,600000,0,38724000,0,0,0,9704000,9704000,9704000,7280000,116451000,{"$f":"[7]Sheet1!$R$25","v":121183000},{"$f":"[7]Sheet1!$S$25","v":129476000}]
["Contributions & Contributed assets",null,null,null,null,null,null,null,null,null,null,null,null,0]
["Proceeds on disposal of PPE",null,null,null,null,null,null,null,null,null,null,null,null,0]
["Short term loans",null,null,null,null,null,null,null,null,null,null,null,null,0]
["Borrowing long term/refinancing",null,null,null,null,null,null,null,null,null,null,null,null,0]
["Increase in consumer deposits",null,null,null,null,null,null,null,null,null,null,null,null,0]
["Receipt of non-current debtors",null,null,null,null,null,null,null,null,null,null,null,null,0]
["Receipt of non-current receivables",null,null,null,null,null,null,null,null,null,null,null,null,0]
["Change in non-current investments",null,null,null,null,null,null,null,null,null,null,null,null,0]
["Total Cash Receipts by Source",null,{"$f":"SUM(C22:C33)","v":270234031},73554549,101293360,79859522,111693891,166708642,83688000,80447000,172430832.14833331,172430832.14833331,172430832.14833331,354480467.55499989,1839251959,2190285248,2153029767]
[null,null,null,null,null,null,null,null,null,null,null,null,null,{"$f":"O35-SUM(C35:M35)","v":0}]
["Cash Payments by Type",null,null,null,null,null,null,null,null,null,null,null,null,0]
["Employee related costs",null,43127000,45571000,52685599,44548311,49244665,47696149,48688000,51396000,47439000,47439000,47439000,43988952,{"$f":"'C4-FinPerf RE'!D26","v":569262676},{"$f":"[7]Sheet1!$R$36","v":602849174},{"$f":"[7]Sheet1!$S$36","v":636608728}]
["Remuneration of councillors",null,2274000,2293000,2312434,2302354,2312434,2316876,3186000,2418000,2230000,2230000,2230000,658228,{"$f":"'C4-FinPerf RE'!D27","v":26763326},{"$f":"[7]Sheet1!$R$37","v":28342363},{"$f":"[7]Sheet1!$S$37","v":29929535}]
["Interest paid",null,0,0,0,null,null,null,9128000,10157,1833000,1833000,1833000,153362843,{"$f":"'C4-FinPerf RE'!D30","v":168000000},{"$f":"[7]Sheet1!$R$38","v":22000000},{"$f":"[7]Sheet1!$S$38","v":22000000}]
["Bulk purchases - Electricity",null,453821,43981471,454103,2243390,1249004,29141443,18961000,18387000,28925000,28925000,28925000,195452271,397098503,{"$f":"[7]Sheet1!$R$40","v":371559104},{"$f":"[7]Sheet1!$S$40","v":401283832}]
["Bulk purchases - Water & Sewer",null,0,8771930,0,8771930,0,17543860,8772000,8772000,22559000,22559000,22559000,200402693,320711413,{"$f":"[7]Sheet1!$R$41","v":292368326},{"$f":"[7]Sheet1!$S$41","v":315757792}]
["Other materials",null,948912,1214368,2459448,6801458,1191829,6482681,2571000,2638000,null,null,null,-24307696,0,{"$f":"[7]Sheet1!$R$42","v":0},{"$f":"[7]Sheet1!$S$42","v":0}]
["Contracted services",null,4018544,0,0,1486709,1011405,2314806,0,987000,7424000,7424000,7424000,56999138,89089602,{"$f":"[7]Sheet1!$R$43","v":82818595},{"$f":"[7]Sheet1!$S$43","v":86148436}]
["Grants and subsidies paid - other municipalities",null,0,0,0,0,0,0,0,3370000,2738000,2738000,2738000,23416000,35000000,{"$f":"[7]Sheet1!$R$44","v":35000000},{"$f":"[7]Sheet1!$S$44","v":35000000}]
["Grants and subsidies paid - other",null,0,0,0,0,0,0,0,0,null,null,null,0,0,{"$f":"[7]Sheet1!$R$45","v":0},{"$f":"[7]Sheet1!$S$45","v":0}]
["General expenses",null,13467287,25946686,20862833,19747564,28188059,33566821,18493000,14638000,23636000,23636000,23636000,-107898250,137920000,{"$f":"[7]Sheet1!$R$46","v":146057280},{"$f":"[7]Sheet1!$S$46","v":154236488}]
["Cash Payments by Type",{"$f":"SUM(B37:B46)","v":0},{"$f":"SUM(C37:C46)","v":64289564},{"$f":"SUM(D37:D46)","v":127778455},78774417,85901716,83197396,139062636,109799000,102616157,136784000,136784000,136784000,542074179,1743845520,1580994842,1680964811]
[null,null,null,null,null,null,null,null,null,null,null,null,null,{"$f":"O48-SUM(C48:M48)","v":0}]
["Other Cash Flows/Payments by Type"]
["Capital assets",null,5236000,6193174,8086255,5778616,3670137,1506000,7270000,8532000,9704000,9704000,9704000,{"$f":"O50-SUM(C50:M50)","v":41066818},116451000,{"$f":"[7]Sheet1!$R$49","v":121183000},{"$f":"[7]Sheet1!$S$49","v":129476000}]
["Repayment of borrowing",null,null,null,null,null,null,null,null,null,null,null,null,{"$f":"O51-SUM(C51:M51)","v":0},0,{"$f":"[7]Sheet1!$R$50","v":0},{"$f":"[7]Sheet1!$S$50","v":0}]
["Other Cash Flows/Payments",null,null,null,null,null,null,null,null,null,null,null,null,{"$f":"O52-SUM(C52:M52)","v":0},0,{"$f":"[7]Sheet1!$R$51","v":229474078},{"$f":"[7]Sheet1!$S$51","v":242324626}]
["Total Cash Payments by Type",{"$f":"SUM(B47:B52)","v":0},69525564,133971629,86860672,91680332,86867533,140568636,117069000,111148157,146488000,146488000,146488000,583140997,1860296520,1931651920,2052765437]
[null,null,null,null,null,null,null,null,null,null,null,null,null,{"$f":"O54-SUM(C54:M54)","v":0}]
["NET INCREASE/(DECREASE) IN CASH HELD",{"$f":"B34-B53","v":0},200708467,-60417080,14432688,-11820810,24826358,26140006,-33381000,-30701157,25942832.148333311,25942832.148333311,25942832.148333311,-228660529.44500011,-21044561,258633328,100264330]
["Cash/cash equivalents at the month/year beginning:",null,30000000,{"$f":"C57","v":230708467},{"$f":"D57","v":170291387},184724075,172903265,197729623,223869629,190488629,159787472,185730304.14833331,211673136.29666662,237615968.44499993,{"$f":"C56","v":30000000},{"$f":"O57","v":8955439},{"$f":"P57","v":267588767}]
["Cash/cash equivalents at the month/year end:",null,{"$f":"C55+C56","v":230708467},{"$f":"D55+D56","v":170291387},{"$f":"E55+E56","v":184724075},172903265,197729623,223869629,190488629,159787472,185730304.14833331,211673136.29666662,237615968.44499993,8955438.9999998212,{"$f":"O55+O56","v":8955439},{"$f":"P55+P56","v":267588767},{"$f":"Q55+Q56","v":367853097}]
[{"$f":"head27a","v":"References"}]
["1. Replace 'budget' heading with adjusted budget, or 'outcome' only for month/s complete"]
["2. Total of monthly amounts must always agree to the approved or adjusted budget"]
["3. Amend 'cash-at-beginning' when prior year actual known (as part of the adjustments budget)"]
[]
[]
[]
[]
[null,null,null,null,{"$f":"E47+E65","v":78774417},85901716,83197396,139062636,109799000,102616157,136784000,136784000,null,{"$f":"N47+N65","v":542074179},1743845520,1580994842]
[null,null,null,null,{"$f":"E55-E65","v":14432688},-11820810,24826358,26140006,-33381000,-30701157,25942832.148333311,25942832.148333311,{"$f":"M55-M65","v":25942832.148333311},{"$f":"N55-N65","v":-228660529.44500011},-21044561,258633328]

{"sheet":"SC10","index":26,"n_rows":47,"n_cols":11,"rows_kept":47,"cut":false,"hidden":false,"merged":[[1,0,2,0],[1,1,2,1],[0,0,0,10]]}
[{"$f":"muni& \" - \"&S71P& \" - \"&Head57","v":"FS184 Matjhabeng - NOT REQUIRED - municipality does not have entities or this is the parent municipality's budget - M08 February"}]
[{"$f":"desc","v":"Description"},{"$f":"head27","v":"Ref"},{"$f":"Head1","v":"2014/15"},{"$f":"Head2","v":"Budget Year 2015/16"}]
[null,null,{"$f":"Head5","v":"Audited Outcome"},{"$f":"Head6","v":"Original Budget"},{"$f":"Head7","v":"Adjusted Budget"},{"$f":"Head38","v":"Monthly actual"},{"$f":"Head39","v":"YearTD actual"},{"$f":"Head40","v":"YearTD budget"},{"$f":"Head41","v":"YTD variance"},{"$f":"Head41","v":"YTD variance"},{"$f":"Head8","v":"Full Year Forecast"}]
["R thousands",1,null,null,null,null,null,null,null,"%"]
[{"$f":"'C4-FinPerf RE'!A5","v":"Revenue By Source"}]
[{"$f":"'C4-FinPerf RE'!A6","v":"Property rates"},null,null,null,null,null,null,null,{"$f":"G6-H6","v":0},{"$f":"IF(I6=0,\"\",I6/H6)","v":""}]
[{"$f":"'C4-FinPerf RE'!A7","v":"Property rates - penalties & collection charges"},null,null,null,null,null,null,null,0,{"$f":"IF(I7=0,\"\",I7/H7)","v":""}]
[{"$f":"'C4-FinPerf RE'!A8","v":"Service charges - electricity revenue"},null,null,null,null,null,null,null,0,""]
[{"$f":"'C4-FinPerf RE'!A9","v":"Service charges - water revenue"},null,null,null,null,null,null,null,0,""]
[{"$f":"'C4-FinPerf RE'!A10","v":"Service charges - sanitation revenue"},null,null,null,null,null,null,null,0,""]
[{"$f":"'C4-FinPerf RE'!A11","v":"Service charges - refuse revenue"},null,null,null,null,null,null,null,0,""]
[{"$f":"'C4-FinPerf RE'!A12","v":"Service charges - other"},null,null,null,null,null,null,null,0,""]
[{"$f":"'C4-FinPerf RE'!A13","v":"Rental of facilities and equipment"},null,null,null,null,null,null,null,0,""]
[{"$f":"'C4-FinPerf RE'!A14","v":"Interest earned - external investments"},null,null,null,null,null,null,null,0,""]
[{"$f":"'C4-FinPerf RE'!A15","v":"Interest earned - outstanding debtors"},null,null,null,null,null,null,null,0,""]
[{"$f":"'C4-FinPerf RE'!A16","v":"Dividends received"},null,null,null,null,null,null,null,0,""]
[{"$f":"'C4-FinPerf RE'!A17","v":"Fines"},null,null,null,null,null,null,null,0,""]
[{"$f":"'C4-FinPerf RE'!A18","v":"Licences and permits"},null,null,null,null,null,null,null,0,""]
[{"$f":"'C4-FinPerf RE'!A19","v":"Agency services"},null,null,null,null,null,null,null,0,""]
[{"$f":"'C4-FinPerf RE'!A20","v":"Transfers recognised - operational"},null,null,null,null,null,null,null,0,""]
[{"$f":"'C4-FinPerf RE'!A21","v":"Other revenue"},null,null,null,null,null,null,null,0,""]
[{"$f":"'C4-FinPerf RE'!A22","v":"Gains on disposal of PPE"},null,null,null,null,null,null,null,0,""]
["Total Revenue (excluding capital transfers and contributions)",null,{"$f":"SUM(C6:C22)","v":0},0,0,0,0,0,{"$f":"G23-H23","v":0},"",{"$f":"SUM(K6:K22)","v":0}]
[]
["Expenditure By Type"]
[{"$f":"'C4-FinPerf RE'!A26","v":"Employee related costs"},null,null,null,null,null,null,null,{"$f":"G26-H26","v":0},{"$f":"IF(I26=0,\"\",I26/H26)","v":""}]
[{"$f":"'C4-FinPerf RE'!A27","v":"Remuneration of councillors"},null,null,null,null,null,null,null,0,""]
[{"$f":"'C4-FinPerf RE'!A28","v":"Debt impairment"},null,null,null,null,null,null,null,0,""]
[{"$f":"'C4-FinPerf RE'!A29","v":"Depreciation & asset impairment"},null,null,null,null,null,null,null,0,""]
[{"$f":"'C4-FinPerf RE'!A30","v":"Finance charges"},null,null,null,null,null,null,null,0,""]
[{"$f":"'C4-FinPerf RE'!A31","v":"Bulk purchases"},null,null,null,null,null,null,null,0,""]
[{"$f":"'C4-FinPerf RE'!A32","v":"Other materials"},null,null,null,null,null,null,null,0,""]
[{"$f":"'C4-FinPerf RE'!A33","v":"Contracted services"},null,null,null,null,null,null,null,0,""]
[{"$f":"'C4-FinPerf RE'!A34","v":"Transfers and grants"},null,null,null,null,null,null,null,0,""]
[{"$f":"'C4-FinPerf RE'!A35","v":"Other expenditure"},null,null,null,null,null,null,null,0,""]
[{"$f":"'C4-FinPerf RE'!A36","v":"Loss on disposal of PPE"},null,null,null,null,null,null,null,0,""]
["Total Expenditure",null,{"$f":"SUM(C26:C36)","v":0},0,0,0,0,0,0,"",{"$f":"SUM(K26:K36)","v":0}]
[null,null,null,null,null,null,null,null,0]
[{"$f":"'C4-FinPerf RE'!A39","v":"Surplus/(Deficit)"},null,{"$f":"C23-C37","v":0},0,0,0,0,0,0,"",{"$f":"K23-K37","v":0}]
[{"$f":"'C4-FinPerf RE'!A40","v":"Transfers recognised - capital"},null,null,null,null,null,null,null,0,""]
[{"$f":"'C4-FinPerf RE'!A41","v":"Contributions recognised - capital"},null,null,null,null,null,null,null,0,""]
[{"$f":"'C4-FinPerf RE'!A42","v":"Contributed assets"},null,null,null,null,null,null,null,0,""]
[{"$f":"'C4-FinPerf RE'!A43","v":"Surplus/(Deficit) after capital transfers & contributions"},null,{"$f":"C39+SUM(C40:C42)","v":0},{"$f":"D39+SUM(D40:D42)","v":0},0,0,0,0,0,"",0]
[{"$f":"'C4-FinPerf RE'!A44","v":"Taxation"},null,null,null,null,null,null,null,0,""]
[{"$f":"'C4-FinPerf RE'!A45","v":"Surplus/(Deficit) after taxation"},null,{"$f":"C43-C44","v":0},0,0,0,0,0,0,"",{"$f":"K43-K44","v":0}]
[{"$f":"head27a","v":"References"}]
["1. Votes (consolidated) are revenue sources and expenditure type"]

{"sheet":"SC11","index":27,"n_rows":49,"n_cols":11,"rows_kept":49,"cut":false,"hidden":false,"merged":[[1,0,2,0],[1,1,2,1],[0,0,0,10],[1,3,1,10]]}
[{"$f":"muni& \" - \"&S71Q& \" - \"&Head57","v":"FS184 Matjhabeng - NOT REQUIRED - municipality does not have entities or this is the parent municipality's budget - M08 February"}]
[{"$f":"desc","v":"Description"},{"$f":"head27","v":"Ref"},{"$f":"Head1","v":"2014/15"},{"$f":"Head2","v":"Budget Year 2015/16"}]
[null,null,{"$f":"Head5","v":"Audited Outcome"},{"$f":"Head6","v":"Original Budget"},{"$f":"Head7","v":"Adjusted Budget"},{"$f":"Head38","v":"Monthly actual"},{"$f":"Head39","v":"YearTD actual"},{"$f":"Head40","v":"YearTD budget"},{"$f":"Head41","v":"YTD variance"},{"$f":"Head41","v":"YTD variance"},{"$f":"Head8","v":"Full Year Forecast"}]
["R thousands",null,null,null,null,null,null,null,null,"%"]
["Revenue By Municipal Entity"]
["Insert name of municipal entity",null,null,null,null,null,null,null,{"$f":"G6-H6","v":0},{"$f":"IF(I6=0,\"\",I6/H6)","v":""}]
[null,null,null,null,null,null,null,null,0,{"$f":"IF(I7=0,\"\",I7/H7)","v":""}]
[null,null,null,null,null,null,null,null,0,""]
[null,null,null,null,null,null,null,null,0,""]
[null,null,null,null,null,null,null,null,0,""]
[null,null,null,null,null,null,null,null,0,""]
[null,null,null,null,null,null,null,null,0,""]
[null,null,null,null,null,null,null,null,0,""]
[null,null,null,null,null,null,null,null,0,""]
[null,null,null,null,null,null,null,null,0,""]
["Total Operating Revenue",1,{"$f":"SUM(C6:C15)","v":0},0,0,0,0,0,0,"",{"$f":"SUM(K6:K15)","v":0}]
[]
["Expenditure By Municipal Entity"]
[{"$f":"A6","v":"Insert name of municipal entity"},null,null,null,null,null,null,null,0,{"$f":"IF(I19=0,\"\",I19/H19)","v":""}]
[{"$f":"IF(A7=\"\",\"\",A7)","v":""},null,null,null,null,null,null,null,0,""]
[{"$f":"IF(A8=\"\",\"\",A8)","v":""},null,null,null,null,null,null,null,0,""]
["",null,null,null,null,null,null,null,0,""]
["",null,null,null,null,null,null,null,0,""]
["",null,null,null,null,null,null,null,0,""]
["",null,null,null,null,null,null,null,0,""]
["",null,null,null,null,null,null,null,0,""]
["",null,null,null,null,null,null,null,0,""]
["",null,null,null,null,null,null,null,0,""]
["Total Operating Expenditure",2,{"$f":"SUM(C19:C28)","v":0},0,0,0,0,0,0,"",{"$f":"SUM(K19:K28)","v":0}]
[null,null,null,null,null,null,null,null,null,""]
[{"$f":"Head42","v":"Surplus/ (Deficit) for the yr/period"},null,{"$f":"C16-C29","v":0},{"$f":"D16-D29","v":0},0,0,0,0,{"$f":"I16+I29","v":0},"",0]
["Capital Expenditure By Municipal Entity"]
[{"$f":"$A$6","v":"Insert name of municipal entity"},null,null,null,null,null,null,null,0,""]
[{"$f":"IF(A7=\"\",\"\",A7)","v":""},null,null,null,null,null,null,null,0,""]
[{"$f":"IF(A8=\"\",\"\",A8)","v":""},null,null,null,null,null,null,null,0,""]
["",null,null,null,null,null,null,null,0,""]
["",null,null,null,null,null,null,null,0,""]
["",null,null,null,null,null,null,null,0,""]
["",null,null,null,null,null,null,null,0,""]
["",null,null,null,null,null,null,null,0,""]
["",null,null,null,null,null,null,null,0,""]
[null,null,null,null,null,null,null,null,null,""]
["Total Capital Expenditure",3,{"$f":"SUM(C32:C42)","v":0},{"$f":"SUM(D32:D42)","v":0},0,0,0,{"$f":"SUM(H32:H42)","v":0},{"$f":"G43-H43","v":0},"",0]
[{"$f":"head27a","v":"References"}]
["1. Must reconcile to the sum of all municipal entity monthly revenue reports"]
["2. Must reconcile to the sum of all municipal entity monthly expenditure reports"]
["3. YTD = Year to date; FAV - favourable variance or unfavourable variance"]
["4. Material variances to be explained"]
["5. Insert additional 'Adjustment' Budget column for each Adjustment made by an entity"]

{"sheet":"SC12","index":28,"n_rows":18,"n_cols":10,"rows_kept":18,"cut":false,"hidden":false,"merged":[[1,0,2,0],[0,0,0,9],[1,2,1,9]]}
[{"$f":"muni& \" - \"&S71R& \" - \"&Head57","v":"FS184 Matjhabeng - Supporting Table SC12 Monthly Budget Statement - capital expenditure trend - M08 February"}]
["Month",{"$f":"Head1","v":"2014/15"},{"$f":"Head2","v":"Budget Year 2015/16"}]
[null,{"$f":"Head5","v":"Audited Outcome"},{"$f":"Head6","v":"Original Budget"},{"$f":"Head7","v":"Adjusted Budget"},{"$f":"Head38","v":"Monthly actual"},{"$f":"Head39","v":"YearTD actual"},{"$f":"Head40","v":"YearTD budget"},{"$f":"Head41","v":"YTD variance"},{"$f":"Head41","v":"YTD variance"},"% spend of Original Budget"]
["R thousands",null,null,null,null,null,null,null,"%"]
["Monthly expenditure performance trend"]
["July",null,12204250,null,5235920,{"$f":"IF(E6>0,E6,\"\")","v":5235920},{"$f":"IF(D6>0,D6,C6)","v":12204250},{"$f":"IF(F6=\"\",0,G6-F6)","v":6968330},{"$f":"IF(F6=\"\",\"\",IF(H6=0,\"\",H6/G6))","v":0.57097568470000204},{"$f":"IF(F6=\"\",\"\",F6/$C$18)","v":3.5752026274999828E-2}]
["August",null,12204250,null,6193174,{"$f":"IF(E7>0,E7+F6,\"\")","v":11429094},{"$f":"IF(D7>0,D7+D6,C7+C6)","v":24408500},12979406,0.53175762541737515,7.8040395763770823E-2]
["September",null,12204250,null,8086000,{"$f":"IF(E8>0,E8+F7,\"\")","v":19515094},{"$f":"IF(D8>0,D8+G7,C8+G7)","v":36612750},17097656,0.46698639135273912,0.13325340216181522]
["October",null,12204250,null,5778616,25293710,{"$f":"IF(D9>0,D9+G8,C9+G8)","v":48817000},23523290,0.48186676772435832,0.17271107742521388]
["November",null,12204250,null,3670137,28963847,61021250,32057403,0.52534818608271705,0.19777158913220122]
["December",null,12204250,null,1505778,30469625,73225500,42755875,0.58389324757085992,0.20805337621457007]
["January",null,12204250,null,7270000,37739625,85429750,47690125,0.55823790892516956,0.25769455312698447]
["February",null,12204250,null,8532000,46271625,97634000,51362375,0.5260705799209292,0.31595294671938057]
["March",null,12204250,null,null,"",109838250,0,"",""]
["April",null,12204250,null,null,"",122042500,0,"",""]
["May",null,12204250,null,null,"",134246750,0,"",""]
["June",null,12204250,null,null,"",146451000,{"$f":"IF(F17=\"\",0,G17-F17)","v":0},{"$f":"IF(F17=\"\",\"\",IF(H17=0,\"\",H17/G17))","v":""},{"$f":"IF(F17=\"\",\"\",F17/$C$18)","v":""}]
["Total Capital expenditure",{"$f":"SUM(B6:B17)","v":0},{"$f":"SUM(C6:C17)","v":146451000},{"$f":"SUM(D6:D17)","v":0},{"$f":"SUM(E6:E17)","v":46271625}]

{"sheet":"SC13a","index":29,"n_rows":86,"n_cols":11,"rows_kept":86,"cut":false,"hidden":false,"merged":[[1,0,2,0],[1,1,2,1],[0,0,0,10]]}
[{"$f":"muni& \" - \"&S71Sa& \" - \"&Head57","v":"FS184 Matjhabeng - Supporting Table SC13a Monthly Budget Statement - capital expenditure on new assets by asset class - M08 February"}]
[{"$f":"desc","v":"Description"},{"$f":"head27","v":"Ref"},{"$f":"Head1","v":"2014/15"},{"$f":"Head2","v":"Budget Year 2015/16"}]
[null,null,{"$f":"Head5","v":"Audited Outcome"},{"$f":"Head6","v":"Original Budget"},{"$f":"Head7","v":"Adjusted Budget"},{"$f":"Head38","v":"Monthly actual"},{"$f":"Head39","v":"YearTD actual"},{"$f":"Head40","v":"YearTD budget"},{"$f":"Head41","v":"YTD variance"},{"$f":"Head41","v":"YTD variance"},{"$f":"Head8","v":"Full Year Forecast"}]
["R thousands",1,null,null,null,null,null,null,null,"%"]
["Capital expenditure on new assets by Asset Class/Sub-class"]
[]
["Infrastructure",null,{"$f":"C8+C11+C15+C19+C22","v":0},56772174,0,6039000,38614000,37848116,{"$f":"H7-G7","v":-765884},{"$f":"IF(I7=0,\"\",I7/H7)","v":-2.0235723225959252E-2},{"$f":"K8+K11+K15+K19+K22","v":57921000}]
["Infrastructure - Road transport",null,{"$f":"SUM(C9:C10)","v":0},17108115,0,2418000,11080000,11405410,325410,2.8531197037195505E-2,{"$f":"SUM(K9:K10)","v":16620000}]
["Roads, Pavements & Bridges",null,null,{"$f":"[8]C5C!D123","v":4350898},null,{"$f":"'C5C'!F123","v":1246000},{"$f":"'C5C'!G123","v":3368000},{"$f":"D9/12*8","v":2900598.6666666665},-467401.33333333349,-0.16113960842106625,{"$f":"G9*12/8","v":5052000}]
["Storm water",null,null,{"$f":"[8]C5C!D124","v":12757217},null,{"$f":"'C5C'!F124","v":1172000},{"$f":"'C5C'!G124","v":7712000},{"$f":"D10/12*8","v":8504811.333333334},792811.33333333395,9.3219155870751497E-2,11568000]
["Infrastructure - Electricity",null,{"$f":"SUM(C12:C14)","v":0},2240000,0,0,673000,1493333.3333333333,820333.33333333326,0.54933035714285716,{"$f":"SUM(K12:K14)","v":1009500}]
["Generation",null,null,null,null,null,null,{"$f":"D12/12*8","v":0},0,""]
["Transmission & Reticulation",null,null,{"$f":"[8]C5C!D141","v":1800000},null,{"$f":"'C5C'!F141","v":0},{"$f":"'C5C'!G141","v":0},{"$f":"D13/12*8","v":1200000},1200000,1,{"$f":"G13*12/8","v":0}]
["Street Lighting",null,null,{"$f":"[8]C5C!D143","v":440000},null,{"$f":"'C5C'!F143","v":0},{"$f":"'C5C'!G143","v":673000},{"$f":"D14/12*8","v":293333.33333333331},-379666.66666666669,-1.2943181818181819,1009500]
["Infrastructure - Water",null,{"$f":"SUM(C16:C18)","v":0},40000,0,0,8120000,26666.666666666668,-8093333.333333333,-303.5,{"$f":"SUM(K16:K18)","v":12180000}]
["Dams & Reservoirs",null,null,null,null,null,null,null,0,""]
["Water purification",null,null,null,null,null,null,null,0,""]
["Reticulation",null,null,{"$f":"[8]C5C!D130","v":40000},null,{"$f":"'C5C'!F130","v":0},{"$f":"'C5C'!G130","v":8120000},{"$f":"D18/12*8","v":26666.666666666668},-8093333.333333333,-303.5,{"$f":"G18*12/8","v":12180000}]
["Infrastructure - Sanitation",null,{"$f":"SUM(C20:C21)","v":0},30741038,0,1317000,8153000,20494025.333333332,12341025.333333332,0.60217673846927355,{"$f":"SUM(K20:K21)","v":12229500}]
["Reticulation",null,null,null,null,null,null,null,0,""]
["Sewerage purification",null,null,{"$f":"[8]C5C!D132","v":30741038},null,{"$f":"'C5C'!F132","v":1317000},{"$f":"'C5C'!G132","v":8153000},{"$f":"D21/12*8","v":20494025.333333332},12341025.333333332,0.60217673846927355,{"$f":"G21*12/8","v":12229500}]
["Infrastructure - Other",null,{"$f":"SUM(C23:C26)","v":0},6643021,0,2304000,10588000,4428680.666666667,-6159319.333333333,-1.3907797371105706,{"$f":"SUM(K23:K26)","v":15882000}]
["Waste Management",null,null,null,null,null,null,null,0,""]
["Transportation",null,null,null,null,null,null,null,0,""]
["Gas",null,null,null,null,null,null,null,0,""]
["Other",null,null,{"$f":"[8]C5C!D107-[8]SC13b!D23","v":6643021},null,{"$f":"'C5C'!F107-SC13b!F23","v":2304000},{"$f":"'C5C'!G107-SC13b!G23","v":10588000},{"$f":"D26/12*8","v":4428680.666666667},-6159319.333333333,-1.3907797371105706,{"$f":"G26*12/8","v":15882000}]
[null,null,null,null,null,null,null,null,null,""]
["Community",null,{"$f":"SUM(C29:C42)","v":0},18631084,0,69000,4082000,12420722.666666668,8338722.6666666679,0.67135567635248705,{"$f":"SUM(K29:K42)","v":6123000}]
["Parks & gardens",null,null,null,null,null,null,null,0,""]
["Sportsfields & stadia",null,null,{"$f":"[8]C5C!D86-D34-[8]SC13b!D40","v":296},null,{"$f":"'C5C'!F84-SC13a!F34-SC13b!F40","v":69000},{"$f":"'C5C'!G84-SC13a!G34-SC13b!G40","v":4082000},{"$f":"D30/12*8","v":197.33333333333334},-4081802.6666666665,-20684.81081081081,{"$f":"G30*12/8","v":6123000}]
["Swimming pools",null,null,null,null,null,null,null,0,""]
["Community halls",null,null,null,null,null,null,null,0,""]
["Libraries",null,null,null,null,null,null,null,0,""]
["Recreational facilities",null,null,18029000,null,0,{"$f":"F34","v":0},{"$f":"D34/12*8","v":12019333.333333334},12019333.333333334,1,{"$f":"G34*12/8","v":0}]
["Fire, safety & emergency",null,null,{"$f":"[8]C5C!D99","v":601788},null,{"$f":"'C5C'!F99","v":0},{"$f":"'C5C'!G99","v":0},{"$f":"D35/12*8","v":401192},401192,1,0]
["Security and policing",null,null,null,null,null,null,null,0,""]
["Buses",null,null,null,null,null,null,null,0,""]
["Clinics",null,null,null,null,null,null,null,0,""]
["Museums & Art Galleries",null,null,null,null,null,null,null,0,""]
["Cemeteries",null,null,null,null,null,null,null,0,""]
["Social rental housing",null,null,null,null,null,null,null,{"$f":"H41-G41","v":0},{"$f":"IF(I41=0,\"\",I41/H41)","v":""}]
["Other",null,null,null,null,null,null,null,0,""]
["Heritage assets",null,{"$f":"SUM(C44:C45)","v":0},0,0,0,0,0,0,"",{"$f":"SUM(K44:K45)","v":0}]
["Buildings",null,null,null,null,null,null,null,0,""]
["Other",null,null,null,null,null,null,null,0,""]
[null,null,null,null,null,null,null,null,0,""]
["Investment properties",null,{"$f":"SUM(C48:C49)","v":0},0,0,0,0,0,0,"",{"$f":"SUM(K48:K49)","v":0}]
["Housing development",null,null,null,null,null,null,null,0,""]
["Other",null,null,null,null,null,null,null,0,""]
["Other assets",null,{"$f":"SUM(C51:C62)","v":0},27031739,0,898000,1156000,18021159.333333332,16865159.333333332,0.93585318354842062,1734000]
["General vehicles",null,null,null,null,null,null,null,0,""]
["Specialised vehicles",null,{"$f":"C78","v":0},0,0,0,0,0,0,"",{"$f":"K78","v":0}]
["Plant & equipment",null,null,null,null,null,null,null,0,""]
["Computers - hardware/equipment",null,null,null,null,null,null,null,0,""]
["Furniture and other office equipment",null,null,null,null,null,null,null,0,"",{"$f":"G55*12/8","v":0}]
["Abattoirs",null,null,null,null,null,null,null,0,""]
["Markets",null,null,null,null,null,null,null,0,""]
["Civic Land and Buildings",null,null,null,null,null,null,null,0,""]
["Other Buildings",null,null,null,null,null,null,null,0,""]
["Other Land",null,null,null,null,null,null,null,0,""]
["Surplus Assets - (Investment or Inventory)",null,null,null,null,null,null,null,0,""]
["Other",null,null,{"$f":"[8]C5C!D8+[8]C5C!D41-[8]SC13b!D59","v":27031739},null,{"$f":"'C5C'!F8","v":898000},{"$f":"'C5C'!G8","v":1156000},{"$f":"D62/12*8","v":18021159.333333332},16865159.333333332,0.93585318354842062,{"$f":"G62*12/8","v":1734000}]
[null,null,null,null,null,null,null,null,null,""]
["Agricultural assets",null,{"$f":"SUM(C65:C66)","v":0},0,0,0,0,0,{"$f":"H64-G64","v":0},"",{"$f":"SUM(K65)","v":0}]
["List sub-class",null,null,null,null,null,null,null,{"$f":"H65-G65","v":0},""]
[null,null,null,null,null,null,null,null,{"$f":"H66-G66","v":0},""]
[null,null,null,null,null,null,null,null,null,{"$f":"IF(I67=0,\"\",I67/H67)","v":""}]
["Biological assets",null,{"$f":"SUM(C69:C70)","v":0},0,0,0,0,0,{"$f":"H68-G68","v":0},{"$f":"IF(I68=0,\"\",I68/H68)","v":""},{"$f":"SUM(K69)","v":0}]
["List sub-class",null,null,null,null,null,null,null,{"$f":"H69-G69","v":0},{"$f":"IF(I69=0,\"\",I69/H69)","v":""}]
[null,null,null,null,null,null,null,null,{"$f":"H70-G70","v":0},{"$f":"IF(I70=0,\"\",I70/H70)","v":""}]
[]
["Intangibles",null,{"$f":"SUM(C73:C74)","v":0},0,0,0,0,0,{"$f":"H72-G72","v":0},{"$f":"IF(I72=0,\"\",I72/H72)","v":""},{"$f":"SUM(K73:K74)","v":0}]
["Computers - software & programming",null,null,null,null,null,null,null,{"$f":"H73-G73","v":0},{"$f":"IF(I73=0,\"\",I73/H73)","v":""}]
["Other",null,null,null,null,null,null,null,{"$f":"H74-G74","v":0},{"$f":"IF(I74=0,\"\",I74/H74)","v":""}]
[]
["Total Capital Expenditure on new assets",1,{"$f":"C7+C28+C43+C47+C50+C64+C68+C72","v":0},102434997,0,7006000,43852000,68289998,24437998,0.35785618268725095,{"$f":"K7+K28+K43+K47+K50+K64+K68+K72","v":65778000}]
[]
["Specialised vehicles",null,{"$f":"SUM(C79:C82)","v":0},0,0,0,0,0,{"$f":"H78-G78","v":0},{"$f":"IF(I78=0,\"\",I78/H78)","v":""},0]
["Refuse",null,null,null,null,null,null,null,{"$f":"H79-G79","v":0},{"$f":"IF(I79=0,\"\",I79/H79)","v":""}]
["Fire",null,null,null,null,null,null,null,{"$f":"H80-G80","v":0},{"$f":"IF(I80=0,\"\",I80/H80)","v":""}]
["Conservancy",null,null,null,null,null,null,null,{"$f":"H81-G81","v":0},{"$f":"IF(I81=0,\"\",I81/H81)","v":""}]
["Ambulances",null,null,null,null,null,null,null,{"$f":"H82-G82","v":0},{"$f":"IF(I82=0,\"\",I82/H82)","v":""}]
[{"$f":"head27a","v":"References"}]
["1. Total Capital Expenditure on new assets (SC13a) plus Total Capital Expenditure on renewal of existing assets (SC13b) must reconcile to total capital expenditure in Table C5"]
[]
["check balance",null,{"$f":"C76+SC13b!C76-'C5-Capex'!C40","v":0},{"$f":"D76+SC13b!D76-'C5-Capex'!D40","v":0},{"$f":"E76+SC13b!E76-'C5-Capex'!E40","v":0},{"$f":"F76+SC13b!F76-'C5-Capex'!F40","v":0},{"$f":"G76+SC13b!G76-'C5-Capex'!G40","v":0},{"$f":"H76+SC13b!H76-'C5-Capex'!H40","v":0},null,null,{"$f":"K76+SC13b!K76-'C5-Capex'!K40","v":0}]

{"sheet":"SC13b","index":30,"n_rows":86,"n_cols":11,"rows_kept":86,"cut":false,"hidden":false,"merged":[[0,0,0,10],[1,0,2,0],[1,1,2,1]]}
[{"$f":"muni& \" - \"&S71Sb& \" - \"&Head57","v":"FS184 Matjhabeng - Supporting Table SC13b Monthly Budget Statement - capital expenditure on renewal of existing assets by asset class - M08 February"}]
[{"$f":"desc","v":"Description"},{"$f":"head27","v":"Ref"},{"$f":"Head1","v":"2014/15"},{"$f":"Head2","v":"Budget Year 2015/16"}]
[null,null,{"$f":"Head5","v":"Audited Outcome"},{"$f":"Head6","v":"Original Budget"},{"$f":"Head7","v":"Adjusted Budget"},{"$f":"Head38","v":"Monthly actual"},{"$f":"Head39","v":"YearTD actual"},{"$f":"Head40","v":"YearTD budget"},{"$f":"Head41","v":"YTD variance"},{"$f":"Head41","v":"YTD variance"},{"$f":"Head8","v":"Full Year Forecast"}]
["R thousands",1,null,null,null,null,null,null,null,"%"]
["Capital expenditure on renewal of existing assets by Asset Class/Sub-class"]
[]
["Infrastructure",null,{"$f":"C8+C11+C15+C19+C22","v":0},8000000,0,0,0,5333333.333333333,{"$f":"H7-G7","v":5333333.333333333},{"$f":"IF(I7=0,\"\",I7/H7)","v":1},{"$f":"K8+K11+K15+K19+K22","v":0}]
["Infrastructure - Road transport",null,{"$f":"SUM(C9:C10)","v":0},0,0,0,0,0,0,"",{"$f":"SUM(K9:K10)","v":0}]
["Roads, Pavements & Bridges",null,null,null,null,null,null,null,0,""]
["Storm water",null,null,null,null,null,null,null,0,""]
["Infrastructure - Electricity",null,{"$f":"SUM(C12:C14)","v":0},0,0,0,0,0,0,"",{"$f":"SUM(K12:K14)","v":0}]
["Generation",null,null,null,null,null,null,null,0,""]
["Transmission & Reticulation",null,null,null,null,null,null,null,0,""]
["Street Lighting",null,null,null,null,null,null,null,0,""]
["Infrastructure - Water",null,{"$f":"SUM(C16:C18)","v":0},0,0,0,0,0,0,"",{"$f":"SUM(K16:K18)","v":0}]
["Dams & Reservoirs",null,null,null,null,null,null,null,0,""]
["Water purification",null,null,null,null,null,null,null,0,""]
["Reticulation",null,null,null,null,null,null,null,0,""]
["Infrastructure - Sanitation",null,{"$f":"SUM(C20:C21)","v":0},0,0,0,0,0,0,"",{"$f":"SUM(K20:K21)","v":0}]
["Reticulation",null,null,null,null,null,null,null,0,""]
["Sewerage purification",null,null,null,null,null,null,null,0,""]
["Infrastructure - Other",null,{"$f":"SUM(C23:C26)","v":0},8000000,0,0,0,5333333.333333333,5333333.333333333,1,{"$f":"SUM(K23:K26)","v":0}]
["Waste Management",null,null,8000000,null,null,{"$f":"F23","v":0},{"$f":"D23/12*8","v":5333333.333333333},5333333.333333333,1,{"$f":"G23*12/8","v":0}]
["Transportation",null,null,null,null,null,null,null,0,""]
["Gas",null,null,null,null,null,null,null,0,""]
["Other",null,null,null,null,null,null,null,0,""]
[null,null,null,null,null,null,null,null,null,""]
["Community",null,{"$f":"SUM(C29:C42)","v":0},29103000,0,1526000,2419000,19402000,16983000,0.87532213173899598,{"$f":"SUM(K29:K42)","v":3628500}]
["Parks & gardens",null,null,null,null,null,null,null,0,""]
["Sportsfields & stadia",null,null,null,null,null,null,null,0,""]
["Swimming pools",null,null,null,null,null,null,null,0,""]
["Community halls",null,null,null,null,null,null,null,0,""]
["Libraries",null,null,null,null,null,null,null,0,""]
["Recreational facilities",null,null,null,null,null,null,null,0,""]
["Fire, safety & emergency",null,null,null,null,null,null,null,0,""]
["Security and policing",null,null,null,null,null,null,null,0,""]
["Buses",null,null,null,null,null,null,null,0,""]
["Clinics",null,null,null,null,null,null,null,0,""]
["Museums & Art Galleries",null,null,null,null,null,null,null,0,""]
["Cemeteries",null,null,29103000,null,1526000,{"$f":"F40+542000+351000","v":2419000},{"$f":"D40/12*8","v":19402000},16983000,0.87532213173899598,{"$f":"G40*12/8","v":3628500}]
["Social rental housing",null,null,null,null,null,null,null,0,""]
["Other",null,null,null,null,null,null,null,0,""]
["Heritage assets",null,{"$f":"SUM(C44:C45)","v":0},0,0,0,0,0,0,"",{"$f":"SUM(K44:K45)","v":0}]
["Buildings",null,null,null,null,null,null,null,0,""]
["Other",null,null,null,null,null,null,null,0,""]
[null,null,null,null,null,null,null,null,0,""]
["Investment properties",null,{"$f":"SUM(C48:C49)","v":0},0,0,0,0,0,0,"",{"$f":"SUM(K48:K49)","v":0}]
["Housing development",null,null,null,null,null,null,null,0,""]
["Other",null,null,null,null,null,null,null,0,""]
["Other assets",null,{"$f":"SUM(C51:C62)","v":0},6913000,0,0,0,4608666.666666667,4608666.666666667,1,0]
["General vehicles",null,null,null,null,null,null,null,0,""]
["Specialised vehicles",null,{"$f":"C78","v":0},0,0,0,0,0,0,"",{"$f":"K78","v":0}]
["Plant & equipment",null,null,null,null,null,null,null,0,""]
["Computers - hardware/equipment",null,null,null,null,null,null,null,0,""]
["Furniture and other office equipment",null,null,null,null,null,null,null,0,""]
["Abattoirs",null,null,null,null,null,null,null,0,""]
["Markets",null,null,null,null,null,null,null,0,""]
["Civic Land and Buildings",null,null,null,null,null,null,null,0,""]
["Other Buildings",null,null,6913000,null,null,{"$f":"F59","v":0},{"$f":"D59/12*8","v":4608666.666666667},4608666.666666667,1,{"$f":"G59*12/8","v":0}]
["Other Land",null,null,null,null,null,null,null,0,""]
["Surplus Assets - (Investment or Inventory)",null,null,null,null,null,null,null,0,""]
["Other",null,null,null,null,null,null,null,0,""]
[null,null,null,null,null,null,null,null,null,""]
["Agricultural assets",null,{"$f":"SUM(C65:C66)","v":0},0,0,0,0,0,{"$f":"H64-G64","v":0},"",{"$f":"SUM(K65)","v":0}]
["List sub-class",null,null,null,null,null,null,null,{"$f":"H65-G65","v":0},""]
[null,null,null,null,null,null,null,null,{"$f":"H66-G66","v":0},""]
[null,null,null,null,null,null,null,null,null,{"$f":"IF(I67=0,\"\",I67/H67)","v":""}]
["Biological assets",null,{"$f":"SUM(C69:C70)","v":0},0,0,0,0,0,{"$f":"H68-G68","v":0},{"$f":"IF(I68=0,\"\",I68/H68)","v":""},{"$f":"SUM(K69)","v":0}]
["List sub-class",null,null,null,null,null,null,null,{"$f":"H69-G69","v":0},{"$f":"IF(I69=0,\"\",I69/H69)","v":""}]
[null,null,null,null,null,null,null,null,{"$f":"H70-G70","v":0},{"$f":"IF(I70=0,\"\",I70/H70)","v":""}]
[]
["Intangibles",null,{"$f":"SUM(C73:C74)","v":0},0,0,0,0,0,{"$f":"H72-G72","v":0},{"$f":"IF(I72=0,\"\",I72/H72)","v":""},{"$f":"SUM(K73:K74)","v":0}]
["Computers - software & programming",null,null,null,null,null,null,null,{"$f":"H73-G73","v":0},{"$f":"IF(I73=0,\"\",I73/H73)","v":""}]
["Other",null,null,null,null,null,null,null,{"$f":"H74-G74","v":0},{"$f":"IF(I74=0,\"\",I74/H74)","v":""}]
[]
["Total Capital Expenditure on renewal of existing assets ",1,{"$f":"C7+C28+C43+C47+C50+C64+C68+C72","v":0},44016000,0,1526000,2419000,29344000,{"$f":"H76-G76","v":26925000},{"$f":"IF(I76=0,\"\",I76/H76)","v":0.91756406761177756},{"$f":"K7+K28+K43+K47+K50+K64+K68+K72","v":3628500}]
[]
["Specialised vehicles",null,{"$f":"SUM(C79:C82)","v":0},0,0,0,0,0,{"$f":"H78-G78","v":0},{"$f":"IF(I78=0,\"\",I78/H78)","v":""},0]
["Refuse",null,null,null,null,null,null,null,{"$f":"H79-G79","v":0},{"$f":"IF(I79=0,\"\",I79/H79)","v":""}]
["Fire",null,null,null,null,null,null,null,{"$f":"H80-G80","v":0},{"$f":"IF(I80=0,\"\",I80/H80)","v":""}]
["Conservancy",null,null,null,null,null,null,null,{"$f":"H81-G81","v":0},{"$f":"IF(I81=0,\"\",I81/H81)","v":""}]
["Ambulances",null,null,null,null,null,null,null,{"$f":"H82-G82","v":0},{"$f":"IF(I82=0,\"\",I82/H82)","v":""}]
[{"$f":"head27a","v":"References"}]
["1. Total Capital Expenditure on new assets (SC13a) plus Total Capital Expenditure on renewal of existing assets (SC13b) must reconcile to total capital expenditure in Table C5"]
[]
["check balance",null,{"$f":"C76+SC13a!C76-'C5-Capex'!C40","v":0},{"$f":"D76+SC13a!D76-'C5-Capex'!D40","v":0},{"$f":"E76+SC13a!E76-'C5-Capex'!E40","v":0},{"$f":"F76+SC13a!F76-'C5-Capex'!F40","v":0},{"$f":"G76+SC13a!G76-'C5-Capex'!G40","v":0},{"$f":"H76+SC13a!H76-'C5-Capex'!H40","v":0},null,null,{"$f":"K76+SC13a!K76-'C5-Capex'!K40","v":0}]

{"sheet":"SC13c","index":31,"n_rows":82,"n_cols":11,"rows_kept":82,"cut":false,"hidden":false,"merged":[[0,0,0,10],[1,0,2,0],[1,1,2,1]]}
[{"$f":"muni& \" - \"&S71Sc& \" - \"&Head57","v":"FS184 Matjhabeng - Supporting Table SC13c Monthly Budget Statement - expenditure on repairs and maintenance by asset class - M08 February"}]
[{"$f":"desc","v":"Description"},{"$f":"head27","v":"Ref"},{"$f":"Head1","v":"2014/15"},{"$f":"Head2","v":"Budget Year 2015/16"}]
[null,null,{"$f":"Head5","v":"Audited Outcome"},{"$f":"Head6","v":"Original Budget"},{"$f":"Head7","v":"Adjusted Budget"},{"$f":"Head38","v":"Monthly actual"},{"$f":"Head39","v":"YearTD actual"},{"$f":"Head40","v":"YearTD budget"},{"$f":"Head41","v":"YTD variance"},{"$f":"Head41","v":"YTD variance"},{"$f":"Head8","v":"Full Year Forecast"}]
["R thousands",1,null,null,null,null,null,null,null,"%"]
["Repairs and maintenance expenditure by Asset Class/Sub-class"]
[]
["Infrastructure",null,{"$f":"C8+C11+C15+C19+C22","v":0},185653058,0,2240000,21478000,123768705.33333331,{"$f":"H7-G7","v":102290705.33333331},{"$f":"IF(I7=0,\"\",I7/H7)","v":0.82646663433898293},{"$f":"K8+K11+K15+K19+K22","v":32217000}]
["Infrastructure - Road transport",null,{"$f":"SUM(C9:C10)","v":0},65311841,0,0,1532000,43541227.333333328,42009227.333333328,0.96481495598937417,{"$f":"SUM(K9:K10)","v":2298000}]
["Roads, Pavements & Bridges",null,null,{"$f":"65311841-17569443","v":47742398},null,0,{"$f":"F9+295000+283000+506000+314000","v":1398000},{"$f":"D9/12*8","v":31828265.333333332},30430265.333333332,0.95607677687241432,{"$f":"G9*12/8","v":2097000}]
["Storm water",null,null,17569443,null,0,{"$f":"F10+104000+30000","v":134000},{"$f":"D10/12*8","v":11712962},11578962,0.9885596828539186,201000]
["Infrastructure - Electricity",null,{"$f":"SUM(C12:C14)","v":0},50237277,0,427000,4339000,33491518,29152518,0.87044480933948709,{"$f":"SUM(K12:K14)","v":6508500}]
["Generation",null,null,null,null,null,{"$f":"F12","v":0},{"$f":"D12/12*8","v":0},0,"",{"$f":"G12*12/8","v":0}]
["Transmission & Reticulation",null,null,{"$f":"50237277-1577642","v":48659635},null,427000,{"$f":"F13+316000+417000+640000+903000+388000+831000+103000","v":4025000},{"$f":"D13/12*8","v":32439756.666666668},28414756.666666668,0.8759238535184245,6037500]
["Street Lighting",null,null,1577642,null,0,{"$f":"F14+31000+173000+17000+93000","v":314000},{"$f":"D14/12*8","v":1051761.3333333333},737761.33333333326,0.70145318139349733,471000]
["Infrastructure - Water",null,{"$f":"SUM(C16:C18)","v":0},26225951,0,1698000,7790000,17483967.333333332,9693967.3333333321,0.55444895020203455,{"$f":"SUM(K16:K18)","v":11685000}]
["Dams & Reservoirs",null,null,null,null,null,{"$f":"F16","v":0},{"$f":"D16/12*8","v":0},0,"",{"$f":"G16*12/8","v":0}]
["Water purification",null,null,null,null,0,{"$f":"F17+809000","v":809000},{"$f":"D17/12*8","v":0},-809000,{"$error":"#DIV/0!"},1213500]
["Reticulation",null,null,{"$f":"58698829-17880065-14592813","v":26225951},null,1698000,{"$f":"F18+294000+472000+1643000+479000+1808000+587000","v":6981000},{"$f":"D18/12*8","v":17483967.333333332},10502967.333333332,0.60071991288323534,10471500]
["Infrastructure - Sanitation",null,{"$f":"SUM(C20:C21)","v":0},32472878,0,115000,7689000,21648585.333333332,13959585.333333332,0.64482667658838244,{"$f":"SUM(K20:K21)","v":11533500}]
["Reticulation",null,null,null,null,null,{"$f":"F20","v":0},{"$f":"D20/12*8","v":0},0,"",{"$f":"G20*12/8","v":0}]
["Sewerage purification",null,null,{"$f":"17880065+14592813","v":32472878},null,115000,{"$f":"F21+146000+22000+179000+3786000+80000+2239000+1122000","v":7689000},{"$f":"D21/12*8","v":21648585.333333332},13959585.333333332,0.64482667658838244,11533500]
["Infrastructure - Other",null,{"$f":"SUM(C23:C26)","v":0},11405111,0,0,128000,7603407.333333333,7475407.333333333,0.98316544223024216,{"$f":"SUM(K23:K26)","v":192000}]
["Waste Management",null,null,11405111,null,null,{"$f":"F23","v":0},{"$f":"D23/12*8","v":7603407.333333333},7603407.333333333,1,{"$f":"G23*12/8","v":0}]
["Transportation",null,null,null,null,null,0,{"$f":"D24/12*8","v":0},0,"",0]
["Gas",null,null,null,null,null,0,{"$f":"D25/12*8","v":0},0,"",0]
["Other",null,null,null,null,0,{"$f":"F26+45000+3000+1000+1000+3000+75000","v":128000},{"$f":"D26/12*8","v":0},-128000,{"$error":"#DIV/0!"},192000]
[null,null,null,null,null,null,null,null,null,""]
["Community",null,{"$f":"SUM(C29:C42)","v":0},4184161,0,25400,1291400,2789440.666666667,1498040.666666667,0.53703980320068956,{"$f":"SUM(K29:K42)","v":1937100}]
["Parks & gardens",null,null,3428081,null,0,{"$f":"F29+118000+29000","v":147000},{"$f":"D29/12*8","v":2285387.3333333335},2138387.3333333335,0.93567829931673141,{"$f":"G29*12/8","v":220500}]
["Sportsfields & stadia",null,null,null,null,0,{"$f":"F30+6000+74000+578000+33000","v":691000},0,-691000,{"$error":"#DIV/0!"},1036500]
["Swimming pools",null,null,null,null,null,{"$f":"F31","v":0},0,0,"",0]
["Community halls",null,null,null,null,0,{"$f":"F32+2000+111000","v":113000},0,-113000,{"$error":"#DIV/0!"},169500]
["Libraries",null,null,null,null,0,{"$f":"F33+1000+1000","v":2000},0,-2000,{"$error":"#DIV/0!"},3000]
["Recreational facilities",null,null,null,null,null,0,0,0,"",0]
["Fire, safety & emergency",null,null,null,null,25400,{"$f":"F35+38000+29000+43000+137000","v":272400},0,-272400,{"$error":"#DIV/0!"},408600]
["Security and policing",null,null,null,null,0,{"$f":"F36+2000","v":2000},0,-2000,{"$error":"#DIV/0!"},3000]
["Buses",null,null,null,null,null,0,0,0,"",0]
["Clinics",null,null,null,null,null,0,0,0,"",0]
["Museums & Art Galleries",null,null,null,null,null,0,0,0,"",0]
["Cemeteries",null,null,null,null,null,0,0,0,"",0]
["Social rental housing",null,null,null,null,null,0,0,0,"",0]
["Other",null,null,756080,null,0,{"$f":"F42+9000+1000+8000+46000","v":64000},504053.33333333331,440053.33333333331,0.8730293090678235,96000]
["Heritage assets",null,{"$f":"SUM(C44:C45)","v":0},0,0,0,0,0,0,"",{"$f":"SUM(K44:K45)","v":0}]
["Buildings",null,null,null,null,null,{"$f":"F44","v":0},{"$f":"D44/12*8","v":0},0,"",{"$f":"G44*12/8","v":0}]
["Other",null,null,null,null,null,0,0,0,"",0]
[null,null,null,null,null,null,null,null,0,""]
["Investment properties",null,{"$f":"SUM(C48:C49)","v":0},0,0,353000,1118000,0,-1118000,{"$error":"#DIV/0!"},{"$f":"SUM(K48:K49)","v":1677000}]
["Housing development",null,null,null,null,353000,{"$f":"F48+13000+260000+169000+25000+160000+138000","v":1118000},{"$f":"D48/12*8","v":0},-1118000,{"$error":"#DIV/0!"},{"$f":"G48*12/8","v":1677000}]
["Other",null,null,null,null,null,{"$f":"F49","v":0},0,0,"",0]
["Other assets",null,{"$f":"SUM(C51:C62)","v":0},26852000,0,19100,419100,17901333.333333332,17482233.333333332,0.9765883360643528,628650]
["General vehicles",null,null,null,null,null,null,null,0,""]
["Specialised vehicles",null,{"$f":"C78","v":0},0,0,0,0,0,0,"",{"$f":"K78","v":0}]
["Plant & equipment",null,null,null,null,null,{"$f":"F53","v":0},{"$f":"D53/12*8","v":0},0,"",{"$f":"G53*12/8","v":0}]
["Computers - hardware/equipment",null,null,null,null,19100,{"$f":"F54+15000+13000+111000+75000+71000+9000","v":313100},0,-313100,{"$error":"#DIV/0!"},469650]
["Furniture and other office equipment",null,null,null,null,null,0,0,0,"",0]
["Abattoirs",null,null,null,null,null,0,0,0,"",0]
["Markets",null,null,null,null,0,{"$f":"F57+6000","v":6000},0,-6000,{"$error":"#DIV/0!"},9000]
["Civic Land and Buildings",null,null,null,null,null,0,0,0,"",0]
["Other Buildings",null,null,null,null,null,0,0,0,"",0]
["Other Land",null,null,null,null,null,0,0,0,"",0]
["Surplus Assets - (Investment or Inventory)",null,null,null,null,null,0,0,0,"",0]
["Other",null,null,26852000,null,0,{"$f":"F62+14000+11000+10000+21000+4000+40000","v":100000},17901333.333333332,17801333.333333332,0.99441382392373012,150000]
[null,null,null,null,null,null,null,null,null,""]
["Agricultural assets",null,{"$f":"SUM(C65:C66)","v":0},0,0,0,0,0,{"$f":"H64-G64","v":0},"",{"$f":"SUM(K65)","v":0}]
["List sub-class",null,null,null,null,null,null,null,{"$f":"H65-G65","v":0},""]
[null,null,null,null,null,null,null,null,{"$f":"H66-G66","v":0},""]
[null,null,null,null,null,null,null,null,null,{"$f":"IF(I67=0,\"\",I67/H67)","v":""}]
["Biological assets",null,{"$f":"SUM(C69:C70)","v":0},0,0,0,0,0,{"$f":"H68-G68","v":0},{"$f":"IF(I68=0,\"\",I68/H68)","v":""},{"$f":"SUM(K69)","v":0}]
["List sub-class",null,null,null,null,null,null,null,{"$f":"H69-G69","v":0},{"$f":"IF(I69=0,\"\",I69/H69)","v":""}]
[null,null,null,null,null,null,null,null,{"$f":"H70-G70","v":0},{"$f":"IF(I70=0,\"\",I70/H70)","v":""}]
[]
["Intangibles",null,{"$f":"SUM(C73:C74)","v":0},0,0,0,0,0,{"$f":"H72-G72","v":0},{"$f":"IF(I72=0,\"\",I72/H72)","v":""},{"$f":"SUM(K73:K74)","v":0}]
["Computers - software & programming",null,null,null,null,null,null,null,{"$f":"H73-G73","v":0},{"$f":"IF(I73=0,\"\",I73/H73)","v":""}]
["Other",null,null,null,null,null,null,null,{"$f":"H74-G74","v":0},{"$f":"IF(I74=0,\"\",I74/H74)","v":""}]
[]
["Total Repairs and Maintenance Expenditure",null,{"$f":"C7+C28+C43+C47+C50+C64+C68+C72","v":0},216689219,0,2637500,24306500,144459479.33333331,{"$f":"H76-G76","v":120152979.33333331},{"$f":"IF(I76=0,\"\",I76/H76)","v":0.83174174438276971},{"$f":"K7+K28+K43+K47+K50+K64+K68+K72","v":36459750}]
[]
["Specialised vehicles",null,{"$f":"SUM(C79:C82)","v":0},0,0,0,0,0,{"$f":"H78-G78","v":0},{"$f":"IF(I78=0,\"\",I78/H78)","v":""},0]
["Refuse",null,null,null,null,null,null,null,{"$f":"H79-G79","v":0},{"$f":"IF(I79=0,\"\",I79/H79)","v":""}]
["Fire",null,null,null,null,null,null,null,{"$f":"H80-G80","v":0},{"$f":"IF(I80=0,\"\",I80/H80)","v":""}]
["Conservancy",null,null,null,null,null,null,null,{"$f":"H81-G81","v":0},{"$f":"IF(I81=0,\"\",I81/H81)","v":""}]
["Ambulances",null,null,null,null,null,null,null,{"$f":"H82-G82","v":0},{"$f":"IF(I82=0,\"\",I82/H82)","v":""}]

{"sheet":"SC13d","index":32,"n_rows":82,"n_cols":11,"rows_kept":82,"cut":false,"hidden":false,"merged":[[0,0,0,10],[1,0,2,0],[1,1,2,1]]}
[{"$f":"muni& \" - \"&S71Sd& \" - \"&Head57","v":"FS184 Matjhabeng - Supporting Table SC13d Monthly Budget Statement - depreciation by asset class - M08 February"}]
[{"$f":"desc","v":"Description"},{"$f":"head27","v":"Ref"},{"$f":"Head1","v":"2014/15"},{"$f":"Head2","v":"Budget Year 2015/16"}]
[null,null,{"$f":"Head5","v":"Audited Outcome"},{"$f":"Head6","v":"Original Budget"},{"$f":"Head7","v":"Adjusted Budget"},{"$f":"Head38","v":"Monthly actual"},{"$f":"Head39","v":"YearTD actual"},{"$f":"Head40","v":"YearTD budget"},{"$f":"Head41","v":"YTD variance"},{"$f":"Head41","v":"YTD variance"},{"$f":"Head8","v":"Full Year Forecast"}]
["R thousands",1,null,null,null,null,null,null,null,"%"]
["Depreciation by Asset Class/Sub-class"]
[]
["Infrastructure",null,{"$f":"C8+C11+C15+C19+C22","v":0},192680000,0,0,0,128453333.33333333,{"$f":"H7-G7","v":128453333.33333333},{"$f":"IF(I7=0,\"\",I7/H7)","v":1},{"$f":"K8+K11+K15+K19+K22","v":0}]
["Infrastructure - Road transport",null,{"$f":"SUM(C9:C10)","v":0},0,0,0,0,0,0,"",{"$f":"SUM(K9:K10)","v":0}]
["Roads, Pavements & Bridges",null,null,null,null,null,null,null,0,""]
["Storm water",null,null,null,null,null,null,null,0,""]
["Infrastructure - Electricity",null,{"$f":"SUM(C12:C14)","v":0},0,0,0,0,0,0,"",{"$f":"SUM(K12:K14)","v":0}]
["Generation",null,null,null,null,null,null,null,0,""]
["Transmission & Reticulation",null,null,null,null,null,null,null,0,""]
["Street Lighting",null,null,null,null,null,null,null,0,""]
["Infrastructure - Water",null,{"$f":"SUM(C16:C18)","v":0},0,0,0,0,0,0,"",{"$f":"SUM(K16:K18)","v":0}]
["Dams & Reservoirs",null,null,null,null,null,null,null,0,""]
["Water purification",null,null,null,null,null,null,null,0,""]
["Reticulation",null,null,null,null,null,null,null,0,""]
["Infrastructure - Sanitation",null,{"$f":"SUM(C20:C21)","v":0},0,0,0,0,0,0,"",{"$f":"SUM(K20:K21)","v":0}]
["Reticulation",null,null,null,null,null,null,null,0,""]
["Sewerage purification",null,null,null,null,null,null,null,0,""]
["Infrastructure - Other",null,{"$f":"SUM(C23:C26)","v":0},192680000,0,0,0,128453333.33333333,128453333.33333333,1,{"$f":"SUM(K23:K26)","v":0}]
["Waste Management",null,null,null,null,null,null,null,0,""]
["Transportation",null,null,null,null,null,null,null,0,""]
["Gas",null,null,null,null,null,null,null,0,""]
["Other",null,null,192680000,null,null,{"$f":"F26","v":0},{"$f":"D26/12*8","v":128453333.33333333},128453333.33333333,1,{"$f":"G26*12/8","v":0}]
[null,null,null,null,null,null,null,null,null,""]
["Community",null,{"$f":"SUM(C29:C42)","v":0},0,0,0,0,0,0,"",{"$f":"SUM(K29:K42)","v":0}]
["Parks & gardens",null,null,null,null,null,null,null,0,""]
["Sportsfields & stadia",null,null,null,null,null,null,null,0,""]
["Swimming pools",null,null,null,null,null,null,null,0,""]
["Community halls",null,null,null,null,null,null,null,0,""]
["Libraries",null,null,null,null,null,null,null,0,""]
["Recreational facilities",null,null,null,null,null,null,null,0,""]
["Fire, safety & emergency",null,null,null,null,null,null,null,0,""]
["Security and policing",null,null,null,null,null,null,null,0,""]
["Buses",null,null,null,null,null,null,null,0,""]
["Clinics",null,null,null,null,null,null,null,0,""]
["Museums & Art Galleries",null,null,null,null,null,null,null,0,""]
["Cemeteries",null,null,null,null,null,null,null,0,""]
["Social rental housing",null,null,null,null,null,null,null,0,""]
["Other",null,null,null,null,null,null,null,0,""]
["Heritage assets",null,{"$f":"SUM(C44:C45)","v":0},0,0,0,0,0,0,"",{"$f":"SUM(K44:K45)","v":0}]
["Buildings",null,null,null,null,null,null,null,0,""]
["Other",null,null,null,null,null,null,null,0,""]
[null,null,null,null,null,null,null,null,0,""]
["Investment properties",null,{"$f":"SUM(C48:C49)","v":0},0,0,0,0,0,0,"",{"$f":"SUM(K48:K49)","v":0}]
["Housing development",null,null,null,null,null,null,null,0,""]
["Other",null,null,null,null,null,null,null,0,""]
["Other assets",null,{"$f":"SUM(C51:C62)","v":0},0,0,0,0,0,0,"",0]
["General vehicles",null,null,null,null,null,null,null,0,""]
["Specialised vehicles",null,{"$f":"C78","v":0},0,0,0,0,0,0,"",{"$f":"K78","v":0}]
["Plant & equipment",null,null,null,null,null,null,null,0,""]
["Computers - hardware/equipment",null,null,null,null,null,null,null,0,""]
["Furniture and other office equipment",null,null,null,null,null,null,null,0,""]
["Abattoirs",null,null,null,null,null,null,null,0,""]
["Markets",null,null,null,null,null,null,null,0,""]
["Civic Land and Buildings",null,null,null,null,null,null,null,0,""]
["Other Buildings",null,null,null,null,null,null,null,0,""]
["Other Land",null,null,null,null,null,null,null,0,""]
["Surplus Assets - (Investment or Inventory)",null,null,null,null,null,null,null,0,""]
["Other",null,null,null,null,null,null,null,0,""]
[null,null,null,null,null,null,null,null,null,""]
["Agricultural assets",null,{"$f":"SUM(C65:C66)","v":0},0,0,0,0,0,{"$f":"H64-G64","v":0},"",{"$f":"SUM(K65)","v":0}]
["List sub-class",null,null,null,null,null,null,null,{"$f":"H65-G65","v":0},""]
[null,null,null,null,null,null,null,null,{"$f":"H66-G66","v":0},""]
[null,null,null,null,null,null,null,null,null,{"$f":"IF(I67=0,\"\",I67/H67)","v":""}]
["Biological assets",null,{"$f":"SUM(C69:C70)","v":0},0,0,0,0,0,{"$f":"H68-G68","v":0},{"$f":"IF(I68=0,\"\",I68/H68)","v":""},{"$f":"SUM(K69)","v":0}]
["List sub-class",null,null,null,null,null,null,null,{"$f":"H69-G69","v":0},{"$f":"IF(I69=0,\"\",I69/H69)","v":""}]
[null,null,null,null,null,null,null,null,{"$f":"H70-G70","v":0},{"$f":"IF(I70=0,\"\",I70/H70)","v":""}]
[]
["Intangibles",null,{"$f":"SUM(C73:C74)","v":0},0,0,0,0,0,{"$f":"H72-G72","v":0},{"$f":"IF(I72=0,\"\",I72/H72)","v":""},{"$f":"SUM(K73:K74)","v":0}]
["Computers - software & programming",null,null,null,null,null,null,null,{"$f":"H73-G73","v":0},{"$f":"IF(I73=0,\"\",I73/H73)","v":""}]
["Other",null,null,null,null,null,null,null,{"$f":"H74-G74","v":0},{"$f":"IF(I74=0,\"\",I74/H74)","v":""}]
[]
["Total Depreciation",null,{"$f":"C7+C28+C43+C47+C50+C64+C68+C72","v":0},192680000,0,0,0,128453333.33333333,{"$f":"H76-G76","v":128453333.33333333},{"$f":"IF(I76=0,\"\",I76/H76)","v":1},{"$f":"K7+K28+K43+K47+K50+K64+K68+K72","v":0}]
[]
["Specialised vehicles",null,{"$f":"SUM(C79:C82)","v":0},0,0,0,0,0,{"$f":"H78-G78","v":0},{"$f":"IF(I78=0,\"\",I78/H78)","v":""},0]
["Refuse",null,null,null,null,null,null,null,{"$f":"H79-G79","v":0},{"$f":"IF(I79=0,\"\",I79/H79)","v":""}]
["Fire",null,null,null,null,null,null,null,{"$f":"H80-G80","v":0},{"$f":"IF(I80=0,\"\",I80/H80)","v":""}]
["Conservancy",null,null,null,null,null,null,null,{"$f":"H81-G81","v":0},{"$f":"IF(I81=0,\"\",I81/H81)","v":""}]
["Ambulances",null,null,null,null,null,null,null,{"$f":"H82-G82","v":0},{"$f":"IF(I82=0,\"\",I82/H82)","v":""}]

{"sheet":"SC71charts","index":33,"n_rows":104,"n_cols":10,"rows_kept":104,"cut":false,"hidden":false,"merged":[]}
[{"$f":"'Template names'!B101","v":"Chart C1 2015/16 Capital Expenditure Monthly Trend: actual v target"}]
["Month",{"$f":"'SC12'!B2","v":"2014/15"},{"$f":"'SC12'!C3","v":"Original Budget"},{"$f":"'SC12'!D3","v":"Adjusted Budget"},{"$f":"'SC12'!E3","v":"Monthly actual"}]
[{"$f":"LEFT('SC12'!A6,3)","v":"Jul"},{"$f":"'SC12'!B6","v":0},{"$f":"'SC12'!C6","v":12204250},{"$f":"'SC12'!D6","v":0},{"$f":"'SC12'!E6","v":5235920}]
[{"$f":"LEFT('SC12'!A7,3)","v":"Aug"},{"$f":"'SC12'!B7","v":0},{"$f":"'SC12'!C7","v":12204250},{"$f":"'SC12'!D7","v":0},{"$f":"'SC12'!E7","v":6193174}]
[{"$f":"LEFT('SC12'!A8,3)","v":"Sep"},{"$f":"'SC12'!B8","v":0},{"$f":"'SC12'!C8","v":12204250},{"$f":"'SC12'!D8","v":0},{"$f":"'SC12'!E8","v":8086000}]
[{"$f":"LEFT('SC12'!A9,3)","v":"Oct"},{"$f":"'SC12'!B9","v":0},{"$f":"'SC12'!C9","v":12204250},{"$f":"'SC12'!D9","v":0},{"$f":"'SC12'!E9","v":5778616}]
[{"$f":"LEFT('SC12'!A10,3)","v":"Nov"},{"$f":"'SC12'!B10","v":0},{"$f":"'SC12'!C10","v":12204250},{"$f":"'SC12'!D10","v":0},{"$f":"'SC12'!E10","v":3670137}]
[{"$f":"LEFT('SC12'!A11,3)","v":"Dec"},{"$f":"'SC12'!B11","v":0},{"$f":"'SC12'!C11","v":12204250},{"$f":"'SC12'!D11","v":0},{"$f":"'SC12'!E11","v":1505778}]
[{"$f":"LEFT('SC12'!A12,3)","v":"Jan"},{"$f":"'SC12'!B12","v":0},{"$f":"'SC12'!C12","v":12204250},{"$f":"'SC12'!D12","v":0},{"$f":"'SC12'!E12","v":7270000}]
[{"$f":"LEFT('SC12'!A13,3)","v":"Feb"},{"$f":"'SC12'!B13","v":0},{"$f":"'SC12'!C13","v":12204250},{"$f":"'SC12'!D13","v":0},{"$f":"'SC12'!E13","v":8532000}]
[{"$f":"LEFT('SC12'!A14,3)","v":"Mar"},{"$f":"'SC12'!B14","v":0},{"$f":"'SC12'!C14","v":12204250},{"$f":"'SC12'!D14","v":0},{"$f":"'SC12'!E14","v":0}]
[{"$f":"LEFT('SC12'!A15,3)","v":"Apr"},{"$f":"'SC12'!B15","v":0},{"$f":"'SC12'!C15","v":12204250},{"$f":"'SC12'!D15","v":0},{"$f":"'SC12'!E15","v":0}]
[{"$f":"LEFT('SC12'!A16,3)","v":"May"},{"$f":"'SC12'!B16","v":0},{"$f":"'SC12'!C16","v":12204250},{"$f":"'SC12'!D16","v":0},{"$f":"'SC12'!E16","v":0}]
[{"$f":"LEFT('SC12'!A17,3)","v":"Jun"},{"$f":"'SC12'!B17","v":0},{"$f":"'SC12'!C17","v":12204250},{"$f":"'SC12'!D17","v":0},{"$f":"'SC12'!E17","v":0}]
[]
[]
[]
[]
[]
[]
[]
[]
[]
[]
[]
[{"$f":"'Template names'!B102","v":"Chart C2 2015/16 Capital Expenditure: YTD actual v YTD target"}]
["Month",{"$f":"'SC12'!F3","v":"YearTD actual"},{"$f":"'SC12'!G3","v":"YearTD budget"}]
[{"$f":"LEFT('SC12'!A6,3)","v":"Jul"},{"$f":"'SC12'!F6","v":5235920},{"$f":"'SC12'!G6","v":12204250}]
[{"$f":"LEFT('SC12'!A7,3)","v":"Aug"},{"$f":"'SC12'!F7","v":11429094},{"$f":"'SC12'!G7","v":24408500}]
[{"$f":"LEFT('SC12'!A8,3)","v":"Sep"},{"$f":"'SC12'!F8","v":19515094},{"$f":"'SC12'!G8","v":36612750}]
[{"$f":"LEFT('SC12'!A9,3)","v":"Oct"},{"$f":"'SC12'!F9","v":25293710},{"$f":"'SC12'!G9","v":48817000}]
[{"$f":"LEFT('SC12'!A10,3)","v":"Nov"},{"$f":"'SC12'!F10","v":28963847},{"$f":"'SC12'!G10","v":61021250}]
[{"$f":"LEFT('SC12'!A11,3)","v":"Dec"},{"$f":"'SC12'!F11","v":30469625},{"$f":"'SC12'!G11","v":73225500}]
[{"$f":"LEFT('SC12'!A12,3)","v":"Jan"},{"$f":"'SC12'!F12","v":37739625},{"$f":"'SC12'!G12","v":85429750}]
[{"$f":"LEFT('SC12'!A13,3)","v":"Feb"},{"$f":"'SC12'!F13","v":46271625},{"$f":"'SC12'!G13","v":97634000}]
[{"$f":"LEFT('SC12'!A14,3)","v":"Mar"},{"$f":"'SC12'!F14","v":""},{"$f":"'SC12'!G14","v":109838250}]
[{"$f":"LEFT('SC12'!A15,3)","v":"Apr"},{"$f":"'SC12'!F15","v":""},{"$f":"'SC12'!G15","v":122042500}]
[{"$f":"LEFT('SC12'!A16,3)","v":"May"},{"$f":"'SC12'!F16","v":""},{"$f":"'SC12'!G16","v":134246750}]
[{"$f":"LEFT('SC12'!A17,3)","v":"Jun"},{"$f":"'SC12'!F17","v":""},{"$f":"'SC12'!G17","v":146451000}]
[]
[]
[]
[]
[]
[]
[]
[]
[]
[]
[]
[{"$f":"'Template names'!B103","v":"Chart C3 Aged Consumer Debtors Analysis"}]
[null,{"$f":"'SC3'!C3","v":"0-30 Days"},{"$f":"'SC3'!D3","v":"31-60 Days"},{"$f":"'SC3'!E3","v":"61-90 Days"},{"$f":"'SC3'!F3","v":"91-120 Days"},{"$f":"'SC3'!G3","v":"121-150 Dys"},{"$f":"'SC3'!H3","v":"151-180 Dys"},{"$f":"'SC3'!I3","v":"181 Dys-1 Yr"},{"$f":"'SC3'!J3","v":"Over 1Yr"}]
[{"$f":"Head2","v":"Budget Year 2015/16"},{"$f":"'SC3'!C14","v":126984857.44000001},{"$f":"'SC3'!D14","v":84626801.550000504},{"$f":"'SC3'!E14","v":76837752.229993939},{"$f":"'SC3'!F14","v":73406595.400000677},{"$f":"'SC3'!G14","v":78562763.469998613},{"$f":"'SC3'!H14","v":53551358.099994987},{"$f":"'SC3'!I14","v":311779380.33999258},{"$f":"'SC3'!J14","v":1258180433.540154}]
[{"$f":"Head1","v":"2014/15"},{"$f":"'SC3'!C15","v":0},{"$f":"'SC3'!D15","v":0},{"$f":"'SC3'!E15","v":0},{"$f":"'SC3'!F15","v":0},{"$f":"'SC3'!G15","v":0},{"$f":"'SC3'!H15","v":0},{"$f":"'SC3'!I15","v":0},{"$f":"'SC3'!J15","v":0}]
[]
[]
[]
[]
[]
[]
[]
[]
[]
[]
[]
[]
[]
[]
[]
[]
[]
[]
[]
[]
[]
[{"$f":"'Template names'!B104","v":"Chart C4 Consumer Debtors (total by Debtor Customer Category)"}]
[null,{"$f":"Head1","v":"2014/15"},{"$f":"Head2","v":"Budget Year 2015/16"}]
[{"$f":"'SC3'!A17","v":"Organs of State"},{"$f":"C78*0.97","v":39272488.678099997},{"$f":"'SC3'!K17","v":40487101.729999997}]
[{"$f":"'SC3'!A18","v":"Commercial"},{"$f":"C79*0.97","v":430930059.25849974},{"$f":"'SC3'!K18","v":444257793.04999977}]
[{"$f":"'SC3'!A19","v":"Households"},{"$f":"C80*0.97","v":1510144201.4824874},{"$f":"'SC3'!K19","v":1556849692.2499871}]
[{"$f":"'SC3'!A20","v":"Other"},{"$f":"C81*0.97","v":21665294.388944156},{"$f":"'SC3'!K20","v":22335355.040148616}]
[]
[]
[]
[]
[]
[]
[]
[]
[]
[]
[]
[]
[]
[]
[]
[]
[]
[]
[]
[{"$f":"'Template names'!B105","v":"Chart C5 Aged Creditors Analysis"}]
[null,{"$f":"'SC4'!A6","v":"Bulk Electricity"},{"$f":"'SC4'!A7","v":"Bulk Water"},{"$f":"'SC4'!A8","v":"PAYE deductions"},{"$f":"'SC4'!A9","v":"VAT (output less input)"},{"$f":"'SC4'!A10","v":"Pensions / Retirement deductions"},{"$f":"'SC4'!A11","v":"Loan repayments"},{"$f":"'SC4'!A12","v":"Trade Creditors"},{"$f":"'SC4'!A13","v":"Auditor General"},{"$f":"'SC4'!A14","v":"Other"}]
[{"$f":"A54","v":"2014/15"},{"$f":"'SC4'!L6","v":0},{"$f":"'SC4'!L7","v":0},{"$f":"'SC4'!L8","v":0},{"$f":"'SC4'!L9","v":0},{"$f":"'SC4'!L10","v":0},{"$f":"'SC4'!L11","v":0},{"$f":"'SC4'!L12","v":0},{"$f":"'SC4'!L13","v":0},{"$f":"'SC4'!L14","v":0}]
[{"$f":"A53","v":"Budget Year 2015/16"},{"$f":"'SC4'!K6","v":818345000},{"$f":"'SC4'!K7","v":1497183000},{"$f":"'SC4'!K8","v":0},{"$f":"'SC4'!K9","v":0},{"$f":"'SC4'!K10","v":0},{"$f":"'SC4'!K11","v":0},{"$f":"'SC4'!K12","v":60329000},{"$f":"'SC4'!K13","v":5538967},{"$f":"'SC4'!K14","v":0}]